BDBM2952 6-(methylamino)-4-(3-methylbut-1-yn-1-yl)-4-(trifluoromethyl)-2,4-dihydro-1H-3,1-benzoxazin-2-one::Benzoxazinone deriv. 7b::CHEMBL323413
SMILES: CNc1ccc2NC(=O)OC(C#CC(C)C)(c2c1)C(F)(F)F
InChI Key: InChIKey=ZLKKLGIODOFFCC-UHFFFAOYSA-N
Data: 2 IC50
Activity Spreadsheet -- Enzyme Inhibition Constant Data from BindingDB
Found 2 hits for monomerid = 2952
Trg + Lig
Ki
nM
ΔG°
kcal/mole
IC50
nM
Kd
nM
EC50/IC50
nM
koff
s-1
kon
M-1s-1
pHTemp
°C
Human immunodeficiency virus type 1 reverse transcriptase
(Human immunodeficiency virus 1)
BDBM2952
(6-(methylamino)-4-(3-methylbut-1-yn-1-yl)-4-(trifl...)
Show SMILES CNc1ccc2NC(=O)OC(C#CC(C)C)(c2c1)C(F)(F)F
Show InChI InChI=1S/C15H15F3N2O2/c1-9(2)6-7-14(15(16,17)18)11-8-10(19-3)4-5-12(11)20-13(21)22-14/h4-5,8-9,19H,1-3H3,(H,20,21)
n/an/a 473n/an/an/an/an/an/a
S.G.S.I.T.S.
Curated by ChEMBL
Assay Description
Inhibitory activity against HIV-1 reverse transcriptase
Bioorg Med Chem Lett 14: 6089-94 (2004)
Article DOI: 10.1016/j.bmcl.2004.09.068
BindingDB Entry DOI: 10.7270/Q2XS5TVZ
HIV-1 Reverse Transcriptase
(Human immunodeficiency virus type 1)
BDBM2952
(6-(methylamino)-4-(3-methylbut-1-yn-1-yl)-4-(trifl...)
Show SMILES CNc1ccc2NC(=O)OC(C#CC(C)C)(c2c1)C(F)(F)F
Show InChI InChI=1S/C15H15F3N2O2/c1-9(2)6-7-14(15(16,17)18)11-8-10(19-3)4-5-12(11)20-13(21)22-14/h4-5,8-9,19H,1-3H3,(H,20,21)
n/an/a 473n/an/an/an/a8.237
DuPont Pharmaceuticals Company
Assay Description
The IC50 of reverse transcriptase is the concentration that inhibits 50% of recombinant HIV-1 RT RNA-directed DNA polymerase activity in vitro.
Bioorg Med Chem Lett 9: 3221-4 (1999)
Article DOI: 10.1016/s0960-894x(99)00565-x
BindingDB Entry DOI: 10.7270/Q2WH2N65