BDBM297847 7-(Piperidin-4-yl)-3-[3-(trifluoromethoxy)phenyl]pyrazolo[1,5-a]pyrimidin-5(4H)-one hydrochloride::US10118930, Example 70
SMILES: FC(F)(F)Oc1cccc(c1)-c1cnn2c(cc(=O)[nH]c12)C1CCNCC1
InChI Key: InChIKey=FTJDIYWWXDGBPC-UHFFFAOYSA-N
Data: 1 IC50
Activity Spreadsheet -- Enzyme Inhibition Constant Data from BindingDB
Found 1 hit for monomerid = 297847
Trg + Lig
Ki
nM
ΔG°
kcal/mole
IC50
nM
Kd
nM
EC50/IC50
nM
koff
s-1
kon
M-1s-1
pHTemp
°C
Tissue-type plasminogen activator
(Homo sapiens (Human))
BDBM297847
(7-(Piperidin-4-yl)-3-[3-(trifluoromethoxy)phenyl]p...)
Show SMILES FC(F)(F)Oc1cccc(c1)-c1cnn2c(cc(=O)[nH]c12)C1CCNCC1
Show InChI InChI=1S/C18H17F3N4O2/c19-18(20,21)27-13-3-1-2-12(8-13)14-10-23-25-15(9-16(26)24-17(14)25)11-4-6-22-7-5-11/h1-3,8-11,22H,4-7H2,(H,24,26)
NCI pathway
Reactome pathway
US Patent
n/an/a 14n/an/an/an/an/an/a
BAYER PHARMA AKTIENGESELLSCHAFT
US Patent
Assay Description
The clot-lysis test system configures the kinetics of clot formation and degradation in vitro and allows quantifying modulation of the process by sel...
US Patent US10118930 (2018)
BindingDB Entry DOI: 10.7270/Q2QC05J5