BDBM29794 sulfonamide tricyclic analogue, 5
SMILES: CCn1cc2CCS(=O)(=O)N(C)c3cc(cc1c23)C(=O)N[C@@H](Cc1ccccc1)[C@H](O)CNC1CCOCC1
InChI Key: InChIKey=OSAYNAICIRJYGY-RPLLCQBOSA-N
Data: 3 IC50
PDB links: 1 PDB ID contains this monomer as substructures. 1 PDB ID contains inhibitors having a similarity of 90% to this monomer.
Activity Spreadsheet -- Enzyme Inhibition Constant Data from BindingDB
Found 3 hits for monomerid = 29794
Trg + Lig
Ki
nM
ΔG°
kcal/mole
IC50
nM
Kd
nM
EC50/IC50
nM
koff
s-1
kon
M-1s-1
pHTemp
°C
Beta-secretase 1
(Homo sapiens (Human))
BDBM29794
(sulfonamide tricyclic analogue, 5)
Show SMILES CCn1cc2CCS(=O)(=O)N(C)c3cc(cc1c23)C(=O)N[C@@H](Cc1ccccc1)[C@H](O)CNC1CCOCC1 |r|
Show InChI InChI=1S/C29H38N4O5S/c1-3-33-19-21-11-14-39(36,37)32(2)25-16-22(17-26(33)28(21)25)29(35)31-24(15-20-7-5-4-6-8-20)27(34)18-30-23-9-12-38-13-10-23/h4-8,16-17,19,23-24,27,30,34H,3,9-15,18H2,1-2H3,(H,31,35)/t24-,27+/m0/s1
n/an/a 5n/an/an/an/a4.522
GSK
Assay Description
Enzyme activity and inhibition were assayed using a fluorescent FAM-[SEVNLDAEFK]-TAMRA substrate. Control reactions with no enzyme were included in e...
Bioorg Med Chem Lett 19: 3674-8 (2009)
Article DOI: 10.1016/j.bmcl.2009.03.149
BindingDB Entry DOI: 10.7270/Q25H7DKK
Cathepsin D
(Homo sapiens (Human))
BDBM29794
(sulfonamide tricyclic analogue, 5)
Show SMILES CCn1cc2CCS(=O)(=O)N(C)c3cc(cc1c23)C(=O)N[C@@H](Cc1ccccc1)[C@H](O)CNC1CCOCC1 |r|
Show InChI InChI=1S/C29H38N4O5S/c1-3-33-19-21-11-14-39(36,37)32(2)25-16-22(17-26(33)28(21)25)29(35)31-24(15-20-7-5-4-6-8-20)27(34)18-30-23-9-12-38-13-10-23/h4-8,16-17,19,23-24,27,30,34H,3,9-15,18H2,1-2H3,(H,31,35)/t24-,27+/m0/s1
NCI pathway
Reactome pathway
n/an/a 2.11E+3n/an/an/an/an/an/a
GSK
Assay Description
Enzyme activity and inhibition were assayed using a fluorescent FAM-[SEVNLDAEFK]-TAMRA substrate. Control reactions with no enzyme were included in e...
Bioorg Med Chem Lett 19: 3674-8 (2009)
Article DOI: 10.1016/j.bmcl.2009.03.149
BindingDB Entry DOI: 10.7270/Q25H7DKK
Beta-secretase 2
(Homo sapiens (Human))
BDBM29794
(sulfonamide tricyclic analogue, 5)
Show SMILES CCn1cc2CCS(=O)(=O)N(C)c3cc(cc1c23)C(=O)N[C@@H](Cc1ccccc1)[C@H](O)CNC1CCOCC1 |r|
Show InChI InChI=1S/C29H38N4O5S/c1-3-33-19-21-11-14-39(36,37)32(2)25-16-22(17-26(33)28(21)25)29(35)31-24(15-20-7-5-4-6-8-20)27(34)18-30-23-9-12-38-13-10-23/h4-8,16-17,19,23-24,27,30,34H,3,9-15,18H2,1-2H3,(H,31,35)/t24-,27+/m0/s1
n/an/a 590n/an/an/an/an/an/a
GSK
Assay Description
Enzyme activity and inhibition were assayed using a fluorescent FAM-[SEVNLDAEFK]-TAMRA substrate. Control reactions with no enzyme were included in e...
Bioorg Med Chem Lett 19: 3674-8 (2009)
Article DOI: 10.1016/j.bmcl.2009.03.149
BindingDB Entry DOI: 10.7270/Q25H7DKK