BDBM298063 3-[5-(3-chlorobenzyl)-1,3,4-oxadiazol-2-yl]-7-(piperidin-4-yl)pyrazolo[1,5-c]pyrimidin-5(4H)-one hydrochloride::US10118930, Example 274
SMILES: Clc1cccc(Cc2nnc(o2)-c2cnn3c(cc(=O)[nH]c23)C2CCNCC2)c1
InChI Key: InChIKey=NXPQOEBUTOUHCW-UHFFFAOYSA-N
Data: 1 IC50
Activity Spreadsheet -- Enzyme Inhibition Constant Data from BindingDB
Found 1 hit for monomerid = 298063
Trg + Lig
Ki
nM
ΔG°
kcal/mole
IC50
nM
Kd
nM
EC50/IC50
nM
koff
s-1
kon
M-1s-1
pHTemp
°C
Tissue-type plasminogen activator
(Homo sapiens (Human))
BDBM298063
(3-[5-(3-chlorobenzyl)-1,3,4-oxadiazol-2-yl]-7-(pip...)
Show SMILES Clc1cccc(Cc2nnc(o2)-c2cnn3c(cc(=O)[nH]c23)C2CCNCC2)c1
Show InChI InChI=1S/C20H19ClN6O2/c21-14-3-1-2-12(8-14)9-18-25-26-20(29-18)15-11-23-27-16(10-17(28)24-19(15)27)13-4-6-22-7-5-13/h1-3,8,10-11,13,22H,4-7,9H2,(H,24,28)
NCI pathway
Reactome pathway
US Patent
n/an/a 11n/an/an/an/an/an/a
BAYER PHARMA AKTIENGESELLSCHAFT
US Patent
Assay Description
The clot-lysis test system configures the kinetics of clot formation and degradation in vitro and allows quantifying modulation of the process by sel...
US Patent US10118930 (2018)
BindingDB Entry DOI: 10.7270/Q2QC05J5