BDBM29867 phenoxyacetic acid-ether, 9
SMILES: COCCCOc1cc(COc2ccc(cc2)C(F)(F)F)ccc1Sc1ccc(OCC(O)=O)c(C)c1C
InChI Key: InChIKey=SGBHWSPPZXFKMP-UHFFFAOYSA-N
Data: 3 KI  3 EC50
Activity Spreadsheet -- Enzyme Inhibition Constant Data from BindingDB
Found 3 hits for monomerid = 29867
Trg + Lig
Ki
nM
ΔG°
kcal/mole
IC50
nM
Kd
nM
EC50/IC50
nM
koff
s-1
kon
M-1s-1
pHTemp
°C
Peroxisome proliferator-activated receptor delta
(Homo sapiens (Human))
BDBM29867
(phenoxyacetic acid-ether, 9)
Show SMILES COCCCOc1cc(COc2ccc(cc2)C(F)(F)F)ccc1Sc1ccc(OCC(O)=O)c(C)c1C
Show InChI InChI=1S/C28H29F3O6S/c1-18-19(2)25(12-10-23(18)37-17-27(32)33)38-26-11-5-20(15-24(26)35-14-4-13-34-3)16-36-22-8-6-21(7-9-22)28(29,30)31/h5-12,15H,4,13-14,16-17H2,1-3H3,(H,32,33)
8n/an/an/a 1.90E+3n/an/an/an/a
Amgen
Assay Description
The human PPARdelta ligand binding was directly measured using a scintillation proximity assay. Plates were read on a Packard TopCount. IC50 values f...
Bioorg Med Chem Lett 19: 3550-4 (2009)
Article DOI: 10.1016/j.bmcl.2009.04.151
BindingDB Entry DOI: 10.7270/Q2NK3CC0
Peroxisome proliferator-activated receptor alpha (PPAR alpha)
(Homo sapiens (Human))
BDBM29867
(phenoxyacetic acid-ether, 9)
Show SMILES COCCCOc1cc(COc2ccc(cc2)C(F)(F)F)ccc1Sc1ccc(OCC(O)=O)c(C)c1C
Show InChI InChI=1S/C28H29F3O6S/c1-18-19(2)25(12-10-23(18)37-17-27(32)33)38-26-11-5-20(15-24(26)35-14-4-13-34-3)16-36-22-8-6-21(7-9-22)28(29,30)31/h5-12,15H,4,13-14,16-17H2,1-3H3,(H,32,33)
1.20E+3 -7.99n/an/a>1.00E+4n/an/a7.122
Amgen
Assay Description
The human PPARalpha ligand binding was directly measured using a scintillation proximity assay. Plates were read on a Packard TopCount. IC50 values f...
Bioorg Med Chem Lett 19: 3550-4 (2009)
Article DOI: 10.1016/j.bmcl.2009.04.151
BindingDB Entry DOI: 10.7270/Q2NK3CC0
Peroxisome proliferator-activated receptor
(Homo sapiens (Human))
BDBM29867
(phenoxyacetic acid-ether, 9)
Show SMILES COCCCOc1cc(COc2ccc(cc2)C(F)(F)F)ccc1Sc1ccc(OCC(O)=O)c(C)c1C
Show InChI InChI=1S/C28H29F3O6S/c1-18-19(2)25(12-10-23(18)37-17-27(32)33)38-26-11-5-20(15-24(26)35-14-4-13-34-3)16-36-22-8-6-21(7-9-22)28(29,30)31/h5-12,15H,4,13-14,16-17H2,1-3H3,(H,32,33)
NCI pathway
Reactome pathway
2.70E+3n/an/an/a>1.00E+4n/an/an/an/a
Amgen
Assay Description
The human PPARgamma ligand binding was directly measured using a filtration assay in a UniFilter 350 96-well assay plate (Polyfiltronics). The reacti...
Bioorg Med Chem Lett 19: 3550-4 (2009)
Article DOI: 10.1016/j.bmcl.2009.04.151
BindingDB Entry DOI: 10.7270/Q2NK3CC0