BDBM29888 alkynyl ether, 30
SMILES: CCC#CCOc1cc(COc2ccccc2C(F)(F)F)ccc1Sc1ccc(OCC(O)=O)c2CCCCc12
InChI Key: InChIKey=JHRKYWUIHPQPLT-UHFFFAOYSA-N
Data: 3 KI  3 EC50
Activity Spreadsheet -- Enzyme Inhibition Constant Data from BindingDB
Found 3 hits for monomerid = 29888
Trg + Lig
Ki
nM
ΔG°
kcal/mole
IC50
nM
Kd
nM
EC50/IC50
nM
koff
s-1
kon
M-1s-1
pHTemp
°C
Peroxisome proliferator-activated receptor delta
(Homo sapiens (Human))
BDBM29888
(alkynyl ether, 30)
Show SMILES CCC#CCOc1cc(COc2ccccc2C(F)(F)F)ccc1Sc1ccc(OCC(O)=O)c2CCCCc12
Show InChI InChI=1S/C31H29F3O5S/c1-2-3-8-17-37-27-18-21(19-38-26-12-7-6-11-24(26)31(32,33)34)13-15-29(27)40-28-16-14-25(39-20-30(35)36)22-9-4-5-10-23(22)28/h6-7,11-16,18H,2,4-5,9-10,17,19-20H2,1H3,(H,35,36)
120n/an/an/a 1.10E+3n/an/an/an/a
Amgen
Assay Description
The human PPARdelta ligand binding was directly measured using a scintillation proximity assay. Plates were read on a Packard TopCount. IC50 values f...
Bioorg Med Chem Lett 19: 3550-4 (2009)
Article DOI: 10.1016/j.bmcl.2009.04.151
BindingDB Entry DOI: 10.7270/Q2NK3CC0
Peroxisome proliferator-activated receptor gamma
(Homo sapiens (Human))
BDBM29888
(alkynyl ether, 30)
Show SMILES CCC#CCOc1cc(COc2ccccc2C(F)(F)F)ccc1Sc1ccc(OCC(O)=O)c2CCCCc12
Show InChI InChI=1S/C31H29F3O5S/c1-2-3-8-17-37-27-18-21(19-38-26-12-7-6-11-24(26)31(32,33)34)13-15-29(27)40-28-16-14-25(39-20-30(35)36)22-9-4-5-10-23(22)28/h6-7,11-16,18H,2,4-5,9-10,17,19-20H2,1H3,(H,35,36)
NCI pathway
Reactome pathway
170n/an/an/a 4.50E+3n/an/an/an/a
Amgen
Assay Description
The human PPARgamma ligand binding was directly measured using a filtration assay in a UniFilter 350 96-well assay plate (Polyfiltronics). The reacti...
Bioorg Med Chem Lett 19: 3550-4 (2009)
Article DOI: 10.1016/j.bmcl.2009.04.151
BindingDB Entry DOI: 10.7270/Q2NK3CC0
Peroxisome proliferator-activated receptor alpha
(Homo sapiens (Human))
BDBM29888
(alkynyl ether, 30)
Show SMILES CCC#CCOc1cc(COc2ccccc2C(F)(F)F)ccc1Sc1ccc(OCC(O)=O)c2CCCCc12
Show InChI InChI=1S/C31H29F3O5S/c1-2-3-8-17-37-27-18-21(19-38-26-12-7-6-11-24(26)31(32,33)34)13-15-29(27)40-28-16-14-25(39-20-30(35)36)22-9-4-5-10-23(22)28/h6-7,11-16,18H,2,4-5,9-10,17,19-20H2,1H3,(H,35,36)
930 -8.14n/an/a>1.00E+5n/an/a7.122
Amgen
Assay Description
The human PPARalpha ligand binding was directly measured using a scintillation proximity assay. Plates were read on a Packard TopCount. IC50 values f...
Bioorg Med Chem Lett 19: 3550-4 (2009)
Article DOI: 10.1016/j.bmcl.2009.04.151
BindingDB Entry DOI: 10.7270/Q2NK3CC0