BDBM29913 substituted 6-aminoquinoline-3-carbonitrile, 24
SMILES: NCCn1cc(CNc2cc(Cl)c3ncc(C#N)c(Nc4ccc(F)c(Cl)c4)c3c2)nn1
InChI Key: InChIKey=QWDMZKPMUSHZGG-UHFFFAOYSA-N
Data: 1 IC50
Activity Spreadsheet -- Enzyme Inhibition Constant Data from BindingDB
Found 1 hit for monomerid = 29913
Trg + Lig
Ki
nM
ΔG°
kcal/mole
IC50
nM
Kd
nM
EC50/IC50
nM
koff
s-1
kon
M-1s-1
pHTemp
°C
Mitogen-activated protein kinase kinase kinase 8
(Homo sapiens (Human))
BDBM29913
(substituted 6-aminoquinoline-3-carbonitrile, 24)
Show SMILES NCCn1cc(CNc2cc(Cl)c3ncc(C#N)c(Nc4ccc(F)c(Cl)c4)c3c2)nn1
Show InChI InChI=1S/C21H17Cl2FN8/c22-17-6-13(1-2-19(17)24)29-20-12(8-26)9-28-21-16(20)5-14(7-18(21)23)27-10-15-11-32(4-3-25)31-30-15/h1-2,5-7,9,11,27H,3-4,10,25H2,(H,28,29)
NCI pathway
Reactome pathway
n/an/a 17n/an/an/an/a7.230
Wyeth Research
Assay Description
Tpl2/Cot activity was directly assayed using GST-MEK1 as a substrate. The phosphorylation on serine residues 217 and 221 of GST-MEK1 was detected by ...
Bioorg Med Chem Lett 19: 3485-8 (2009)
Article DOI: 10.1016/j.bmcl.2009.05.009
BindingDB Entry DOI: 10.7270/Q2HT2MN8