BDBM29983 arylpyrazole, 28
SMILES: Cc1c(CN[C@H]2CC[C@@H](F)C2)nn(c1-c1ccc(C)nc1)-c1ncccc1Cl
InChI Key: InChIKey=BUSSQQRPMMHCBN-SJORKVTESA-N
Data: 2 IC50  1 EC50
Activity Spreadsheet -- Enzyme Inhibition Constant Data from BindingDB
Found 2 hits for monomerid = 29983
Trg + Lig
Ki
nM
ΔG°
kcal/mole
IC50
nM
Kd
nM
EC50/IC50
nM
koff
s-1
kon
M-1s-1
pHTemp
°C
Potassium voltage-gated channel subfamily H member 2
(Homo sapiens (Human))
BDBM29983
(arylpyrazole, 28)
Show SMILES Cc1c(CN[C@H]2CC[C@@H](F)C2)nn(c1-c1ccc(C)nc1)-c1ncccc1Cl |r|
Show InChI InChI=1S/C21H23ClFN5/c1-13-5-6-15(11-25-13)20-14(2)19(12-26-17-8-7-16(23)10-17)27-28(20)21-18(22)4-3-9-24-21/h3-6,9,11,16-17,26H,7-8,10,12H2,1-2H3/t16-,17+/m1/s1
Reactome pathway
n/an/a 2.90E+4n/an/an/an/an/an/a
Banyu Pharmaceutical Co.
Assay Description
Binding affinity to the hERG K+ channel was measured by displacement of [35S]-radiolabeled MK499 in membranes derived from HEK 293 cells stably trans...
Bioorg Med Chem Lett 19: 3627-31 (2009)
Article DOI: 10.1016/j.bmcl.2009.04.116
BindingDB Entry DOI: 10.7270/Q289145G
Nociceptin receptor
(Homo sapiens (Human))
BDBM29983
(arylpyrazole, 28)
Show SMILES Cc1c(CN[C@H]2CC[C@@H](F)C2)nn(c1-c1ccc(C)nc1)-c1ncccc1Cl |r|
Show InChI InChI=1S/C21H23ClFN5/c1-13-5-6-15(11-25-13)20-14(2)19(12-26-17-8-7-16(23)10-17)27-28(20)21-18(22)4-3-9-24-21/h3-6,9,11,16-17,26H,7-8,10,12H2,1-2H3/t16-,17+/m1/s1
Reactome pathway
n/an/a 2.5n/a 1n/an/an/an/a
Banyu Pharmaceutical Co.
Assay Description
Compounds were tested for their inhibitory effects on ligand binding to the human ORL1 receptor. Bound and free radioligands are separated by filtra...
Bioorg Med Chem Lett 19: 3627-31 (2009)
Article DOI: 10.1016/j.bmcl.2009.04.116
BindingDB Entry DOI: 10.7270/Q289145G