null
SMILES: CCN1CCN(CC1)c1cc2[nH]c(S[C@@]3(C)CC[C@@H](CC3)c3nnc(C)o3)nc2cc1Cl
InChI Key: InChIKey=HQWTVKFLZGDJRG-QXONSOMPSA-N
Activity Spreadsheet -- Enzyme Inhibition Constant Data from BindingDB
Found 2 hits for monomerid = 30018
Trg + Lig
Ki
nM
ΔG°
kcal/mole
IC50
nM
Kd
nM
EC50/IC50
nM
koff
s-1
kon
M-1s-1
pHTemp
°C
Potassium voltage-gated channel subfamily H member 2
(Homo sapiens (Human))
BDBM30018
(benzimidazole analogue, 7q)
Show SMILES CCN1CCN(CC1)c1cc2[nH]c(S[C@@]3(C)CC[C@@H](CC3)c3nnc(C)o3)nc2cc1Cl |r,wU:14.15,18.22,wD:14.14,(-10.04,.77,;-8.71,,;-7.38,.77,;-7.38,2.31,;-6.04,3.08,;-4.71,2.31,;-4.71,.77,;-6.04,,;-3.38,3.08,;-2.04,2.31,;-.71,3.08,;.76,2.6,;1.66,3.85,;3.2,3.85,;3.97,2.52,;4.74,3.85,;3.48,1.06,;4.51,-.1,;6.01,.21,;6.5,1.67,;5.48,2.82,;7.04,-.94,;6.69,-2.44,;8.01,-3.24,;9.17,-2.23,;10.67,-2.58,;8.57,-.81,;.76,5.1,;-.71,4.62,;-2.04,5.39,;-3.38,4.62,;-4.71,5.39,)|
Show InChI InChI=1S/C23H31ClN6OS/c1-4-29-9-11-30(12-10-29)20-14-19-18(13-17(20)24)25-22(26-19)32-23(3)7-5-16(6-8-23)21-28-27-15(2)31-21/h13-14,16H,4-12H2,1-3H3,(H,25,26)/t16-,23-
Reactome pathway
n/an/a>1.00E+4n/an/an/an/an/an/a
Banyu Pharmaceutical Co.
Assay Description
Binding affinity to the hERG K+ channel was measured by displacement of [35S]-radiolabeled MK499 in membranes derived from HEK 293 cells stably trans...
Bioorg Med Chem Lett 19: 3100-3 (2009)
Article DOI: 10.1016/j.bmcl.2009.04.022
BindingDB Entry DOI: 10.7270/Q20R9MRX
Nociceptin receptor
(Homo sapiens (Human))
BDBM30018
(benzimidazole analogue, 7q)
Show SMILES CCN1CCN(CC1)c1cc2[nH]c(S[C@@]3(C)CC[C@@H](CC3)c3nnc(C)o3)nc2cc1Cl |r,wU:14.15,18.22,wD:14.14,(-10.04,.77,;-8.71,,;-7.38,.77,;-7.38,2.31,;-6.04,3.08,;-4.71,2.31,;-4.71,.77,;-6.04,,;-3.38,3.08,;-2.04,2.31,;-.71,3.08,;.76,2.6,;1.66,3.85,;3.2,3.85,;3.97,2.52,;4.74,3.85,;3.48,1.06,;4.51,-.1,;6.01,.21,;6.5,1.67,;5.48,2.82,;7.04,-.94,;6.69,-2.44,;8.01,-3.24,;9.17,-2.23,;10.67,-2.58,;8.57,-.81,;.76,5.1,;-.71,4.62,;-2.04,5.39,;-3.38,4.62,;-4.71,5.39,)|
Show InChI InChI=1S/C23H31ClN6OS/c1-4-29-9-11-30(12-10-29)20-14-19-18(13-17(20)24)25-22(26-19)32-23(3)7-5-16(6-8-23)21-28-27-15(2)31-21/h13-14,16H,4-12H2,1-3H3,(H,25,26)/t16-,23-
Reactome pathway
n/an/a 1.80n/a 7.10n/an/a7.437
Banyu Pharmaceutical Co.
Assay Description
Compounds were tested for their inhibitory effects on ligand binding to the human ORL1 receptor. Bound and free radioligands are separated by filtra...
Bioorg Med Chem Lett 19: 3100-3 (2009)
Article DOI: 10.1016/j.bmcl.2009.04.022
BindingDB Entry DOI: 10.7270/Q20R9MRX