null
SMILES: COc1ccc(OC)c(c1)-c1nnc2ccc(nn12)-c1ccc(OC)c(O[C@@H]2CCOC2)c1
InChI Key: InChIKey=HQUIEUONYYTHEW-QGZVFWFLSA-N
Activity Spreadsheet -- Enzyme Inhibition Constant Data from BindingDB
Found 1 hit for monomerid = 30026
Trg + Lig
Ki
nM
ΔG°
kcal/mole
IC50
nM
Kd
nM
EC50/IC50
nM
koff
s-1
kon
M-1s-1
pHTemp
°C
cAMP-specific 3',5'-cyclic phosphodiesterase 4A
(Homo sapiens (Human))
BDBM30026
(triazolopyridazine, 18)
Show SMILES COc1ccc(OC)c(c1)-c1nnc2ccc(nn12)-c1ccc(OC)c(O[C@@H]2CCOC2)c1 |r|
Show InChI InChI=1S/C24H24N4O5/c1-29-16-5-8-20(30-2)18(13-16)24-26-25-23-9-6-19(27-28(23)24)15-4-7-21(31-3)22(12-15)33-17-10-11-32-14-17/h4-9,12-13,17H,10-11,14H2,1-3H3/t17-/m1/s1
n/an/a 1.5n/an/an/an/a7.222
National Human Genome Research Institute
Assay Description
Inhibition of PDE4A was performed using IMAP technology (Molecular Devices, CA). PDE4A1A mixture was dispensed into 1536-well black/solid bottom assa...
Bioorg Med Chem Lett 19: 3686-92 (2009)
Article DOI: 10.1016/j.bmcl.2009.01.057
BindingDB Entry DOI: 10.7270/Q2W37TNT