BDBM3004 3-((3-Chlorophenyl)amino)-4,6-diamino-1H-pyrazolo[3,4-d]pyrimidine::3-N-(3-chlorophenyl)-1H-pyrazolo[3,4-d]pyrimidine-3,4,6-triamine::pyrazolopyrimidine deriv. 2
SMILES: Nc1nc(N)c2c(Nc3cccc(Cl)c3)[nH]nc2n1
InChI Key: InChIKey=YASYSLUSCVNMAJ-UHFFFAOYSA-N
Data: 4 IC50
Activity Spreadsheet -- Enzyme Inhibition Constant Data from BindingDB
Found 4 hits for monomerid = 3004
Trg + Lig
Ki
nM
ΔG°
kcal/mole
IC50
nM
Kd
nM
EC50/IC50
nM
koff
s-1
kon
M-1s-1
pHTemp
°C
Epidermal growth factor receptor
(Homo sapiens (Human))
BDBM3004
(3-((3-Chlorophenyl)amino)-4,6-diamino-1H-pyrazolo[...)
Show SMILES Nc1nc(N)c2c(Nc3cccc(Cl)c3)[nH]nc2n1
Show InChI InChI=1S/C11H10ClN7/c12-5-2-1-3-6(4-5)15-9-7-8(13)16-11(14)17-10(7)19-18-9/h1-4H,(H6,13,14,15,16,17,18,19)
n/an/a 220n/an/an/an/a7.520
Novartis Pharmaceuticals
Assay Description
IC50 is the inhibitor concentration which inhibits 50% of kinase activity that catalyzes the transfer of the terminal phosphate from [gamma-32P] labe...
J Med Chem 40: 3601-16 (1997)
Article DOI: 10.1021/jm970124v
BindingDB Entry DOI: 10.7270/Q2H70D0N
Protein Kinase C, alpha
(Bos taurus (bovine))
BDBM3004
(3-((3-Chlorophenyl)amino)-4,6-diamino-1H-pyrazolo[...)
Show SMILES Nc1nc(N)c2c(Nc3cccc(Cl)c3)[nH]nc2n1
Show InChI InChI=1S/C11H10ClN7/c12-5-2-1-3-6(4-5)15-9-7-8(13)16-11(14)17-10(7)19-18-9/h1-4H,(H6,13,14,15,16,17,18,19)
Reactome pathway
n/an/a>1.00E+5n/an/an/an/a7.5n/a
Novartis Pharmaceuticals
Assay Description
IC50 is the inhibitor concentration which inhibits 50% of kinase activity that catalyzes the transfer of the terminal phosphate from [gamma-32P] labe...
J Med Chem 40: 3601-16 (1997)
Article DOI: 10.1021/jm970124v
BindingDB Entry DOI: 10.7270/Q2H70D0N
Proto-oncogene tyrosine-protein kinase Src
(Homo sapiens (Human))
BDBM3004
(3-((3-Chlorophenyl)amino)-4,6-diamino-1H-pyrazolo[...)
Show SMILES Nc1nc(N)c2c(Nc3cccc(Cl)c3)[nH]nc2n1
Show InChI InChI=1S/C11H10ClN7/c12-5-2-1-3-6(4-5)15-9-7-8(13)16-11(14)17-10(7)19-18-9/h1-4H,(H6,13,14,15,16,17,18,19)
n/an/a>1.00E+4n/an/an/an/a7.520
Novartis Pharmaceuticals
Assay Description
IC50 is the inhibitor concentration which inhibits 50% of kinase activity that catalyzes the transfer of the terminal phosphate from [gamma-32P] labe...
J Med Chem 40: 3601-16 (1997)
Article DOI: 10.1021/jm970124v
BindingDB Entry DOI: 10.7270/Q2H70D0N
Tyrosine-protein kinase transforming protein Abl
(Abelson murine leukemia virus)
BDBM3004
(3-((3-Chlorophenyl)amino)-4,6-diamino-1H-pyrazolo[...)
Show SMILES Nc1nc(N)c2c(Nc3cccc(Cl)c3)[nH]nc2n1
Show InChI InChI=1S/C11H10ClN7/c12-5-2-1-3-6(4-5)15-9-7-8(13)16-11(14)17-10(7)19-18-9/h1-4H,(H6,13,14,15,16,17,18,19)
n/an/a 1.90E+3n/an/an/an/a7.520
Novartis Pharmaceuticals
Assay Description
IC50 is the inhibitor concentration which inhibits 50% of kinase activity that catalyzes the transfer of the terminal phosphate from [gamma-32P] labe...
J Med Chem 40: 3601-16 (1997)
Article DOI: 10.1021/jm970124v
BindingDB Entry DOI: 10.7270/Q2H70D0N