null
SMILES: Cc1ccc(cc1)-c1nc2cnn(CC3CCNC3)c2cc1-c1ccc(cc1)C#N
InChI Key: InChIKey=VPZVQQMZAXUPLN-UHFFFAOYSA-N
Activity Spreadsheet -- Enzyme Inhibition Constant Data from BindingDB
Found 3 hits for monomerid = 301020
Trg + Lig
Ki
nM
ΔG°
kcal/mole
IC50
nM
Kd
nM
EC50/IC50
nM
koff
s-1
kon
M-1s-1
pHTemp
°C
Lysine-specific histone demethylase 1A
(Homo sapiens (Human))
BDBM301020
(4-[5-(4-methylphenyl)-1-(pyrrolidin-3- ylmethyl)py...)
Show SMILES Cc1ccc(cc1)-c1nc2cnn(CC3CCNC3)c2cc1-c1ccc(cc1)C#N
Show InChI InChI=1S/C25H23N5/c1-17-2-6-21(7-3-17)25-22(20-8-4-18(13-26)5-9-20)12-24-23(29-25)15-28-30(24)16-19-10-11-27-14-19/h2-9,12,15,19,27H,10-11,14,16H2,1H3
Reactome pathway
US Patent
n/an/a<10n/an/an/an/an/an/a
Celgene Quanticel Research, Inc.
US Patent
Assay Description
The enzymatic assay of LSD1 activity is based on Time Resolved-Fluorescence Resonance Energy Transfer (TR-FRET) detection. The inhibitory properties ...
US Patent US10131664 (2018)
BindingDB Entry DOI: 10.7270/Q2JD4ZV1
Lysine-specific histone demethylase 1A
(Homo sapiens (Human))
BDBM301020
(4-[5-(4-methylphenyl)-1-(pyrrolidin-3- ylmethyl)py...)
Show SMILES Cc1ccc(cc1)-c1nc2cnn(CC3CCNC3)c2cc1-c1ccc(cc1)C#N
Show InChI InChI=1S/C25H23N5/c1-17-2-6-21(7-3-17)25-22(20-8-4-18(13-26)5-9-20)12-24-23(29-25)15-28-30(24)16-19-10-11-27-14-19/h2-9,12,15,19,27H,10-11,14,16H2,1H3
Reactome pathway
US Patent
n/an/a<100n/an/an/an/an/an/a
Celgene Quanticel Research, Inc.
US Patent
Assay Description
The enzymatic assay of LSD1 activity is based on Time Resolved-Fluorescence Resonance Energy Transfer (TR-FRET) detection. The inhibitory properties ...
US Patent US10864202 (2020)
Lysine-specific histone demethylase 1A
(Homo sapiens (Human))
BDBM301020
(4-[5-(4-methylphenyl)-1-(pyrrolidin-3- ylmethyl)py...)
Show SMILES Cc1ccc(cc1)-c1nc2cnn(CC3CCNC3)c2cc1-c1ccc(cc1)C#N
Show InChI InChI=1S/C25H23N5/c1-17-2-6-21(7-3-17)25-22(20-8-4-18(13-26)5-9-20)12-24-23(29-25)15-28-30(24)16-19-10-11-27-14-19/h2-9,12,15,19,27H,10-11,14,16H2,1H3
Reactome pathway
US Patent
n/an/a<100n/an/an/an/an/an/a
Celgene Quanticel Research, Inc.
US Patent
Assay Description
This assay determines the ability of a test compound to inhibit LSD1 demethylase activity. E. coli expressed full-length human LSD1 (Accession number...
US Patent US10543198 (2020)
BindingDB Entry DOI: 10.7270/Q29G5Q6H