BDBM301022 4-[1-[[(1S,5R)-3- azabicyclo[3.1.0]hexan-6-yl]methyl]-5- (4-methylphenyl)pyrazolo[4,3- b]pyridin-6-yl]benzonitrile::US10131664, Example 15
SMILES: Cc1ccc(cc1)-c1nc2cnn(C[C@H]3[C@@H]4CNC[C@H]34)c2cc1-c1ccc(cc1)[N+]#[C-]
InChI Key: InChIKey=PXIQKCNNPHGNHB-JKHIJQBDSA-N
Data: 1 IC50
Activity Spreadsheet -- Enzyme Inhibition Constant Data from BindingDB
Found 1 hit for monomerid = 301022
Trg + Lig
Ki
nM
ΔG°
kcal/mole
IC50
nM
Kd
nM
EC50/IC50
nM
koff
s-1
kon
M-1s-1
pHTemp
°C
Lysine-specific histone demethylase 1A
(Homo sapiens (Human))
BDBM301022
(4-[1-[[(1S,5R)-3- azabicyclo[3.1.0]hexan-6-yl]meth...)
Show SMILES Cc1ccc(cc1)-c1nc2cnn(C[C@H]3[C@@H]4CNC[C@H]34)c2cc1-c1ccc(cc1)[N+]#[C-] |r|
Show InChI InChI=1S/C26H23N5/c1-16-3-5-18(6-4-16)26-20(17-7-9-19(27-2)10-8-17)11-25-24(30-26)14-29-31(25)15-23-21-12-28-13-22(21)23/h3-11,14,21-23,28H,12-13,15H2,1H3/t21-,22+,23+
Reactome pathway
US Patent
n/an/a<10n/an/an/an/an/an/a
Celgene Quanticel Research, Inc.
US Patent
Assay Description
The enzymatic assay of LSD1 activity is based on Time Resolved-Fluorescence Resonance Energy Transfer (TR-FRET) detection. The inhibitory properties ...
US Patent US10131664 (2018)
BindingDB Entry DOI: 10.7270/Q2JD4ZV1