BDBM301082 4-[2-(4-aminopiperidin-1-yl)-5-(1,2- dimethylbenzimidazol-5-yl)pyrimidin- 4-yl]benzonitrile::US10131664, Example 75
SMILES: Cc1nc2cc(ccc2n1C)-c1cnc(nc1-c1ccc(cc1)C#N)N1CCC(N)CC1
InChI Key: InChIKey=DDMIJGTXTGXKKR-UHFFFAOYSA-N
Data: 1 IC50
Activity Spreadsheet -- Enzyme Inhibition Constant Data from BindingDB
Found 1 hit for monomerid = 301082
Trg + Lig
Ki
nM
ΔG°
kcal/mole
IC50
nM
Kd
nM
EC50/IC50
nM
koff
s-1
kon
M-1s-1
pHTemp
°C
Lysine-specific histone demethylase 1A
(Homo sapiens (Human))
BDBM301082
(4-[2-(4-aminopiperidin-1-yl)-5-(1,2- dimethylbenzi...)
Show SMILES Cc1nc2cc(ccc2n1C)-c1cnc(nc1-c1ccc(cc1)C#N)N1CCC(N)CC1
Show InChI InChI=1S/C25H25N7/c1-16-29-22-13-19(7-8-23(22)31(16)2)21-15-28-25(32-11-9-20(27)10-12-32)30-24(21)18-5-3-17(14-26)4-6-18/h3-8,13,15,20H,9-12,27H2,1-2H3
Reactome pathway
US Patent
n/an/a<10n/an/an/an/an/an/a
Celgene Quanticel Research, Inc.
US Patent
Assay Description
The enzymatic assay of LSD1 activity is based on Time Resolved-Fluorescence Resonance Energy Transfer (TR-FRET) detection. The inhibitory properties ...
US Patent US10131664 (2018)
BindingDB Entry DOI: 10.7270/Q2JD4ZV1