BDBM301580 US10131675, Example 66
SMILES: Cc1c[nH]c2ncc(cc12)-c1nc(N2CC(F)(F)C2)c2nc3n(CCOC3(C)C)c2n1
InChI Key: InChIKey=WDFMTBWESLCUIJ-UHFFFAOYSA-N
Data: 1 KI
Activity Spreadsheet -- Enzyme Inhibition Constant Data from BindingDB
Found 1 hit for monomerid = 301580
Trg + Lig
Ki
nM
ΔG°
kcal/mole
IC50
nM
Kd
nM
EC50/IC50
nM
koff
s-1
kon
M-1s-1
pHTemp
°C
Mitogen-activated protein kinase kinase kinase 12
(Homo sapiens (Human))
BDBM301580
(US10131675, Example 66)
Show SMILES Cc1c[nH]c2ncc(cc12)-c1nc(N2CC(F)(F)C2)c2nc3n(CCOC3(C)C)c2n1 |$;;;HN;;;;;;;;;;;;;;;;;;;;;;;;;;;$|
Show InChI InChI=1S/C21H21F2N7O/c1-11-7-24-16-13(11)6-12(8-25-16)15-27-17(29-9-21(22,23)10-29)14-18(28-15)30-4-5-31-20(2,3)19(30)26-14/h6-8H,4-5,9-10H2,1-3H3,(H,24,25)
US Patent
11.9n/an/an/an/an/an/an/an/a
Genentech, Inc.
US Patent
Assay Description
DLK kinase reactions (20 μL) containing 5 nM N-terminally GST-tagged DLK (catalytic domain amino acid 1-520) (Carna Bioscience), 40 nM N-termina...
US Patent US10131675 (2018)
BindingDB Entry DOI: 10.7270/Q21G0P92