null
SMILES: COc1cc(OC)nc(n1)N1CCN(CCCc2c[nH]c3ccc(Cl)cc23)CC1
InChI Key: InChIKey=ZLODVRBYJXEQOJ-UHFFFAOYSA-N
Activity Spreadsheet -- Enzyme Inhibition Constant Data from BindingDB
Found 1 hit for monomerid = 301954
Trg + Lig
Ki
nM
ΔG°
kcal/mole
IC50
nM
Kd
nM
EC50/IC50
nM
koff
s-1
kon
M-1s-1
pHTemp
°C
5-hydroxytryptamine receptor 1A
(Homo sapiens (Human))
BDBM301954
(5-Chloro-3-(3-(4-(4,6-dimethoxypyrimidin-2-yl)pipe...)
Show SMILES COc1cc(OC)nc(n1)N1CCN(CCCc2c[nH]c3ccc(Cl)cc23)CC1
Show InChI InChI=1S/C21H26ClN5O2/c1-28-19-13-20(29-2)25-21(24-19)27-10-8-26(9-11-27)7-3-4-15-14-23-18-6-5-16(22)12-17(15)18/h5-6,12-14,23H,3-4,7-11H2,1-2H3
US Patent
2n/an/an/an/an/an/an/an/a
SUNSHINE LAKE PHARMA CO., LTD.
US Patent
Assay Description
Human HEK-293 cell homogenates (36 μg protein) were incubated at 22° C. for 60 minutes with 0.3 nM [3H]8-OH-DPAT (Perkin-Elmer) in the absence o...
US Patent US9598401 (2017)
BindingDB Entry DOI: 10.7270/Q2GH9M1F