null
SMILES: Cc1cc(C)nc(n1)N1CCN(CCCCc2c[nH]c3ccc(Cl)cc23)CC1
InChI Key: InChIKey=UKPMJTJLVKZNOO-UHFFFAOYSA-N
Activity Spreadsheet -- Enzyme Inhibition Constant Data from BindingDB
Found 1 hit for monomerid = 301959
Trg + Lig
Ki
nM
ΔG°
kcal/mole
IC50
nM
Kd
nM
EC50/IC50
nM
koff
s-1
kon
M-1s-1
pHTemp
°C
5-hydroxytryptamine receptor 1A
(Homo sapiens (Human))
BDBM301959
(5-Chloro-3-(4-(4-(4,6-dimethylpyrimidin-2-yl)piper...)
Show SMILES Cc1cc(C)nc(n1)N1CCN(CCCCc2c[nH]c3ccc(Cl)cc23)CC1
Show InChI InChI=1S/C22H28ClN5/c1-16-13-17(2)26-22(25-16)28-11-9-27(10-12-28)8-4-3-5-18-15-24-21-7-6-19(23)14-20(18)21/h6-7,13-15,24H,3-5,8-12H2,1-2H3
US Patent
1.80n/an/an/an/an/an/an/an/a
SUNSHINE LAKE PHARMA CO., LTD.
US Patent
Assay Description
Human HEK-293 cell homogenates (36 μg protein) were incubated at 22° C. for 60 minutes with 0.3 nM [3H]8-OH-DPAT (Perkin-Elmer) in the absence o...
US Patent US9598401 (2017)
BindingDB Entry DOI: 10.7270/Q2GH9M1F