null
SMILES: Cc1cc(C)nc(n1)N1CCN(CCCc2c[nH]c3ccc(cc23)C#N)CC1
InChI Key: InChIKey=FDWQJJBZFAJIEZ-UHFFFAOYSA-N
Activity Spreadsheet -- Enzyme Inhibition Constant Data from BindingDB
Found 1 hit for monomerid = 301966
Trg + Lig
Ki
nM
ΔG°
kcal/mole
IC50
nM
Kd
nM
EC50/IC50
nM
koff
s-1
kon
M-1s-1
pHTemp
°C
5-hydroxytryptamine receptor 1A
(Homo sapiens (Human))
BDBM301966
(3-(3-(4-(4,6-Dimethylpyrimidin-2-yl)piperazin-1-yl...)
Show SMILES Cc1cc(C)nc(n1)N1CCN(CCCc2c[nH]c3ccc(cc23)C#N)CC1
Show InChI InChI=1S/C22H26N6/c1-16-12-17(2)26-22(25-16)28-10-8-27(9-11-28)7-3-4-19-15-24-21-6-5-18(14-23)13-20(19)21/h5-6,12-13,15,24H,3-4,7-11H2,1-2H3
US Patent
1.10n/an/an/an/an/an/an/an/a
SUNSHINE LAKE PHARMA CO., LTD.
US Patent
Assay Description
Human HEK-293 cell homogenates (36 μg protein) were incubated at 22° C. for 60 minutes with 0.3 nM [3H]8-OH-DPAT (Perkin-Elmer) in the absence o...
US Patent US9598401 (2017)
BindingDB Entry DOI: 10.7270/Q2GH9M1F