BDBM301968 3-(3-(4-(4-Methoxy-6-methylpyrimidin-2-yl)piperazin-1-yl)propyl)-1H-indole-5-carbonitrile::US9598401, Example 22
SMILES: COc1cc(C)nc(n1)N1CCN(CCCc2c[nH]c3ccc(cc23)[N+]#[C-])CC1
InChI Key: InChIKey=URDKSSIEPGHGEZ-UHFFFAOYSA-N
Data: 1 KI
Activity Spreadsheet -- Enzyme Inhibition Constant Data from BindingDB
Found 1 hit for monomerid = 301968
Trg + Lig
Ki
nM
ΔG°
kcal/mole
IC50
nM
Kd
nM
EC50/IC50
nM
koff
s-1
kon
M-1s-1
pHTemp
°C
5-hydroxytryptamine receptor 1A
(Homo sapiens (Human))
BDBM301968
(3-(3-(4-(4-Methoxy-6-methylpyrimidin-2-yl)piperazi...)
Show SMILES COc1cc(C)nc(n1)N1CCN(CCCc2c[nH]c3ccc(cc23)[N+]#[C-])CC1
Show InChI InChI=1S/C22H26N6O/c1-16-13-21(29-3)26-22(25-16)28-11-9-27(10-12-28)8-4-5-17-15-24-20-7-6-18(23-2)14-19(17)20/h6-7,13-15,24H,4-5,8-12H2,1,3H3
US Patent
1.5n/an/an/an/an/an/an/an/a
SUNSHINE LAKE PHARMA CO., LTD.
US Patent
Assay Description
Human HEK-293 cell homogenates (36 μg protein) were incubated at 22° C. for 60 minutes with 0.3 nM [3H]8-OH-DPAT (Perkin-Elmer) in the absence o...
US Patent US9598401 (2017)
BindingDB Entry DOI: 10.7270/Q2GH9M1F