null
SMILES: COc1cc(C)cc2cc(sc12)-c1c(CN2CC[C@@H](C2)N(C)C)cn2ncnc(N)c12
InChI Key: InChIKey=AKNCKKKGJAAVEH-KRWDZBQOSA-N
Activity Spreadsheet -- Enzyme Inhibition Constant Data from BindingDB
Found 2 hits for monomerid = 302420
Trg + Lig
Ki
nM
ΔG°
kcal/mole
IC50
nM
Kd
nM
EC50/IC50
nM
koff
s-1
kon
M-1s-1
pHTemp
°C
Fibroblast growth factor receptor 3
(Homo sapiens (Human))
BDBM302420
(US9598416, Example 66)
Show SMILES COc1cc(C)cc2cc(sc12)-c1c(CN2CC[C@@H](C2)N(C)C)cn2ncnc(N)c12 |r|
Show InChI InChI=1S/C23H28N6OS/c1-14-7-15-9-19(31-22(15)18(8-14)30-4)20-16(10-28-6-5-17(12-28)27(2)3)11-29-21(20)23(24)25-13-26-29/h7-9,11,13,17H,5-6,10,12H2,1-4H3,(H2,24,25,26)/t17-/m0/s1
Reactome pathway
US Patent
n/an/a 0.5n/an/an/an/an/an/a
BAYER INTELLECTUAL PROPERTY GMBH
US Patent
US Patent US9598416 (2017)
BindingDB Entry DOI: 10.7270/Q2Q2428R
Fibroblast growth factor receptor 1
(Homo sapiens (Human))
BDBM302420
(US9598416, Example 66)
Show SMILES COc1cc(C)cc2cc(sc12)-c1c(CN2CC[C@@H](C2)N(C)C)cn2ncnc(N)c12 |r|
Show InChI InChI=1S/C23H28N6OS/c1-14-7-15-9-19(31-22(15)18(8-14)30-4)20-16(10-28-6-5-17(12-28)27(2)3)11-29-21(20)23(24)25-13-26-29/h7-9,11,13,17H,5-6,10,12H2,1-4H3,(H2,24,25,26)/t17-/m0/s1
NCI pathway
Reactome pathway
US Patent
n/an/a 1n/an/an/an/an/an/a
BAYER INTELLECTUAL PROPERTY GMBH
US Patent
Assay Description
Usually, test compounds were tested on the same microtiter plate at 11 different concentrations in the range of 20 μM to 0.1 nM (e.g. 20 μM...
US Patent US9598416 (2017)
BindingDB Entry DOI: 10.7270/Q2Q2428R