null
SMILES: NC(=O)c1c2CN(CCn2nc1-c1cccc(F)c1)C(=O)Nc1ccc(F)c(F)c1
InChI Key: InChIKey=AHSHJRWNXIJFLX-UHFFFAOYSA-N
Activity Spreadsheet -- Enzyme Inhibition Constant Data from BindingDB
Found 2 hits for monomerid = 302463
Trg + Lig
Ki
nM
ΔG°
kcal/mole
IC50
nM
Kd
nM
EC50/IC50
nM
koff
s-1
kon
M-1s-1
pHTemp
°C
Casein kinase I isoform delta
(Homo sapiens (Human))
BDBM302463
(N5-(3,4-Difluorophenyl)- 2-(3-fluorophenyl)-6,7- d...)
Show SMILES NC(=O)c1c2CN(CCn2nc1-c1cccc(F)c1)C(=O)Nc1ccc(F)c(F)c1
Show InChI InChI=1S/C20H16F3N5O2/c21-12-3-1-2-11(8-12)18-17(19(24)29)16-10-27(6-7-28(16)26-18)20(30)25-13-4-5-14(22)15(23)9-13/h1-5,8-9H,6-7,10H2,(H2,24,29)(H,25,30)
US Patent
n/an/a<10n/an/an/an/an/an/a
Bristol-Myers Squibb Company
US Patent
Assay Description
The kinase assay was performed in V-bottom 384-well plates. The final assay volume was 30 μl prepared from 15 μl additions of enzyme, subst...
US Patent US9598423 (2017)
BindingDB Entry DOI: 10.7270/Q2FJ2JT9
Casein kinase I isoform epsilon
(Homo sapiens (Human))
BDBM302463
(N5-(3,4-Difluorophenyl)- 2-(3-fluorophenyl)-6,7- d...)
Show SMILES NC(=O)c1c2CN(CCn2nc1-c1cccc(F)c1)C(=O)Nc1ccc(F)c(F)c1
Show InChI InChI=1S/C20H16F3N5O2/c21-12-3-1-2-11(8-12)18-17(19(24)29)16-10-27(6-7-28(16)26-18)20(30)25-13-4-5-14(22)15(23)9-13/h1-5,8-9H,6-7,10H2,(H2,24,29)(H,25,30)
US Patent
n/an/a 55n/an/an/an/an/an/a
Bristol-Myers Squibb Company
US Patent
Assay Description
The kinase assay was performed in V-bottom 384-well plates. The final assay volume was 30 μl prepared from 15 μl additions of enzyme, subst...
US Patent US9598423 (2017)
BindingDB Entry DOI: 10.7270/Q2FJ2JT9