BDBM30273 carboline analog, 85
SMILES: CC1CNC(=O)c2[nH]c3ccc(cc3c12)C(=O)Nc1nc(cs1)C(=O)NC1CCN(C)CC1
InChI Key: InChIKey=HPMBJLMHMXBQEW-UHFFFAOYSA-N
Data: 1 IC50
Activity Spreadsheet -- Enzyme Inhibition Constant Data from BindingDB
Found 1 hit for monomerid = 30273
Trg + Lig
Ki
nM
ΔG°
kcal/mole
IC50
nM
Kd
nM
EC50/IC50
nM
koff
s-1
kon
M-1s-1
pHTemp
°C
MAPK-Activated Protein Kinase 2 (MK2)
(Homo sapiens (Human))
BDBM30273
(carboline analog, 85)
Show SMILES CC1CNC(=O)c2[nH]c3ccc(cc3c12)C(=O)Nc1nc(cs1)C(=O)NC1CCN(C)CC1
Show InChI InChI=1S/C23H26N6O3S/c1-12-10-24-22(32)19-18(12)15-9-13(3-4-16(15)26-19)20(30)28-23-27-17(11-33-23)21(31)25-14-5-7-29(2)8-6-14/h3-4,9,11-12,14,26H,5-8,10H2,1-2H3,(H,24,32)(H,25,31)(H,27,28,30)
Reactome pathway
n/an/a 10n/an/an/an/an/an/a
Boehringer Ingelheim Pharmaceuticals Inc.
Assay Description
Diluted compounds and activated GST-MK2 were incubated in neutravidin coated plates (Pierce) in reaction buffer containing biotinylated GST-LSP1 and ...
Bioorg Med Chem Lett 17: 4664-9 (2007)
Article DOI: 10.1016/j.bmcl.2007.05.101
BindingDB Entry DOI: 10.7270/Q23N21QP
3D
3D Structure (docked)