BDBM303010 (2S,4R)-1-(2-(3- acetyl-5-(pyrimidin-5- ylamino)-1H-indol-1- yl)acetyl)-N-(5- chloropyridin-3-yl)-4- fluoropyrrolidine-2- carboxamide::US10660876, Cmpd No. 22::US9598446, Compound 22
SMILES: CC(=O)c1cn(CC(=O)N2C[C@H](F)C[C@H]2C(=O)Nc2cncc(Cl)c2)c2ccc(Nc3cncnc3)cc12
InChI Key: InChIKey=HBJCDWDKJMRYCW-OSPHWJPCSA-N
Data: 2 IC50
Activity Spreadsheet -- Enzyme Inhibition Constant Data from BindingDB
Found 2 hits for monomerid = 303010
Trg + Lig
Ki
nM
ΔG°
kcal/mole
IC50
nM
Kd
nM
EC50/IC50
nM
koff
s-1
kon
M-1s-1
pHTemp
°C
Complement factor D
(Homo sapiens (Human))
BDBM303010
((2S,4R)-1-(2-(3- acetyl-5-(pyrimidin-5- ylamino)-1...)
Show SMILES CC(=O)c1cn(CC(=O)N2C[C@H](F)C[C@H]2C(=O)Nc2cncc(Cl)c2)c2ccc(Nc3cncnc3)cc12 |r|
Show InChI InChI=1S/C26H23ClFN7O3/c1-15(36)22-12-34(23-3-2-18(6-21(22)23)32-20-9-30-14-31-10-20)13-25(37)35-11-17(28)5-24(35)26(38)33-19-4-16(27)7-29-8-19/h2-4,6-10,12,14,17,24,32H,5,11,13H2,1H3,(H,33,38)/t17-,24+/m1/s1
US Patent
n/an/a<1.00E+3n/an/an/an/an/an/a
Achillion Pharmaceuticals, Inc.
US Patent
Assay Description
Human Factor D (purified from human serum, Complement Technology, Inc.) at 80 nM final concentration is incubated with test compound at various conce...
US Patent US10660876 (2020)
Complement factor D
(Homo sapiens (Human))
BDBM303010
((2S,4R)-1-(2-(3- acetyl-5-(pyrimidin-5- ylamino)-1...)
Show SMILES CC(=O)c1cn(CC(=O)N2C[C@H](F)C[C@H]2C(=O)Nc2cncc(Cl)c2)c2ccc(Nc3cncnc3)cc12 |r|
Show InChI InChI=1S/C26H23ClFN7O3/c1-15(36)22-12-34(23-3-2-18(6-21(22)23)32-20-9-30-14-31-10-20)13-25(37)35-11-17(28)5-24(35)26(38)33-19-4-16(27)7-29-8-19/h2-4,6-10,12,14,17,24,32H,5,11,13H2,1H3,(H,33,38)/t17-,24+/m1/s1
US Patent
n/an/a<1.00E+3n/an/an/an/an/an/a
ACHILLION PHARMACEUTICALS, INC.
US Patent
Assay Description
Human factor D (purified from human serum, Complement Technology, Inc.) at 80 nM final concentration is incubated with test compound at various conce...
US Patent US9598446 (2017)
BindingDB Entry DOI: 10.7270/Q2ST7RWF