BDBM303013 (2S,4R)-1-(2-(3- acetyl-5-(pyrimidin-5- ylamino)-1H-indol-1- yl)acetyl)-4-fluoro-N- (1H-indazol-6- yl)pyrrolidine-2- carboxamide::US10660876, Cmpd No. 25::US9598446, Compound 25
SMILES: CC(=O)c1cn(CC(=O)N2C[C@H](F)C[C@H]2C(=O)Nc2ccc3cn[nH]c3c2)c2ccc(Nc3cncnc3)cc12
InChI Key:
Data: 2 IC50
Activity Spreadsheet -- Enzyme Inhibition Constant Data from BindingDB
Found 2 hits for monomerid = 303013
Trg + Lig
Ki
nM
ΔG°
kcal/mole
IC50
nM
Kd
nM
EC50/IC50
nM
koff
s-1
kon
M-1s-1
pHTemp
°C
Complement factor D
(Homo sapiens (Human))
BDBM303013
((2S,4R)-1-(2-(3- acetyl-5-(pyrimidin-5- ylamino)-1...)
Show SMILES CC(=O)c1cn(CC(=O)N2C[C@H](F)C[C@H]2C(=O)Nc2ccc3cn[nH]c3c2)c2ccc(Nc3cncnc3)cc12 |r|
US Patent
n/an/a<1.00E+3n/an/an/an/an/an/a
Achillion Pharmaceuticals, Inc.
US Patent
Assay Description
Human Factor D (purified from human serum, Complement Technology, Inc.) at 80 nM final concentration is incubated with test compound at various conce...
US Patent US10660876 (2020)
Complement factor D
(Homo sapiens (Human))
BDBM303013
((2S,4R)-1-(2-(3- acetyl-5-(pyrimidin-5- ylamino)-1...)
Show SMILES CC(=O)c1cn(CC(=O)N2C[C@H](F)C[C@H]2C(=O)Nc2ccc3cn[nH]c3c2)c2ccc(Nc3cncnc3)cc12 |r|
US Patent
n/an/a<1.00E+3n/an/an/an/an/an/a
ACHILLION PHARMACEUTICALS, INC.
US Patent
Assay Description
Human factor D (purified from human serum, Complement Technology, Inc.) at 80 nM final concentration is incubated with test compound at various conce...
US Patent US9598446 (2017)
BindingDB Entry DOI: 10.7270/Q2ST7RWF