BDBM303051 (2S,4R)-1-(2-(3- acetyl-5-(pyrimidin-5- ylamino)-1H-indol-1- yl)acetyl)-N- (benzo[d]thiazol-6- yl)-4- fluoropyrrolidine-2- carboxamide::US10660876, Cmpd No. 56::US9598446, Compound 56
SMILES: CC(=O)c1cn(CC(=O)N2C[C@H](F)C[C@H]2C(=O)Nc2ccc3ncsc3c2)c2ccc(Nc3cncnc3)cc12
InChI Key: InChIKey=ZHGHVKKSEKQRFQ-NSYGIPOTSA-N
Data: 2 IC50
Activity Spreadsheet -- Enzyme Inhibition Constant Data from BindingDB
Found 2 hits for monomerid = 303051
Trg + Lig
Ki
nM
ΔG°
kcal/mole
IC50
nM
Kd
nM
EC50/IC50
nM
koff
s-1
kon
M-1s-1
pHTemp
°C
Complement factor D
(Homo sapiens (Human))
BDBM303051
((2S,4R)-1-(2-(3- acetyl-5-(pyrimidin-5- ylamino)-1...)
Show SMILES CC(=O)c1cn(CC(=O)N2C[C@H](F)C[C@H]2C(=O)Nc2ccc3ncsc3c2)c2ccc(Nc3cncnc3)cc12 |r,$;;;;;;;;;;;;;;;;;HN;;;;;;;;;;;;;;;;;;;;;;$|
Show InChI InChI=1S/C28H24FN7O3S/c1-16(37)22-12-35(24-5-3-18(7-21(22)24)33-20-9-30-14-31-10-20)13-27(38)36-11-17(29)6-25(36)28(39)34-19-2-4-23-26(8-19)40-15-32-23/h2-5,7-10,12,14-15,17,25,33H,6,11,13H2,1H3,(H,34,39)/t17-,25+/m1/s1
US Patent
n/an/a<1.00E+3n/an/an/an/an/an/a
Achillion Pharmaceuticals, Inc.
US Patent
Assay Description
Human Factor D (purified from human serum, Complement Technology, Inc.) at 80 nM final concentration is incubated with test compound at various conce...
US Patent US10660876 (2020)
Complement factor D
(Homo sapiens (Human))
BDBM303051
((2S,4R)-1-(2-(3- acetyl-5-(pyrimidin-5- ylamino)-1...)
Show SMILES CC(=O)c1cn(CC(=O)N2C[C@H](F)C[C@H]2C(=O)Nc2ccc3ncsc3c2)c2ccc(Nc3cncnc3)cc12 |r,$;;;;;;;;;;;;;;;;;HN;;;;;;;;;;;;;;;;;;;;;;$|
Show InChI InChI=1S/C28H24FN7O3S/c1-16(37)22-12-35(24-5-3-18(7-21(22)24)33-20-9-30-14-31-10-20)13-27(38)36-11-17(29)6-25(36)28(39)34-19-2-4-23-26(8-19)40-15-32-23/h2-5,7-10,12,14-15,17,25,33H,6,11,13H2,1H3,(H,34,39)/t17-,25+/m1/s1
US Patent
n/an/a<1.00E+3n/an/an/an/an/an/a
ACHILLION PHARMACEUTICALS, INC.
US Patent
Assay Description
Human factor D (purified from human serum, Complement Technology, Inc.) at 80 nM final concentration is incubated with test compound at various conce...
US Patent US9598446 (2017)
BindingDB Entry DOI: 10.7270/Q2ST7RWF