BDBM303380 US10138222, Example 105
SMILES: Cc1cc(F)c(cc1-c1cnn(c1)-c1cncc(c1)C1CC1)C(=O)NC1CC1
InChI Key: InChIKey=HXBDNPHXKSRSOK-UHFFFAOYSA-N
Data: 1 IC50
Activity Spreadsheet -- Enzyme Inhibition Constant Data from BindingDB
Found 1 hit for monomerid = 303380
Trg + Lig
Ki
nM
ΔG°
kcal/mole
IC50
nM
Kd
nM
EC50/IC50
nM
koff
s-1
kon
M-1s-1
pHTemp
°C
Serine/threonine-protein kinase RIPK2
(Homo sapiens (Human))
BDBM303380
(US10138222, Example 105)
Show SMILES Cc1cc(F)c(cc1-c1cnn(c1)-c1cncc(c1)C1CC1)C(=O)NC1CC1
Show InChI InChI=1S/C22H21FN4O/c1-13-6-21(23)20(22(28)26-17-4-5-17)8-19(13)16-10-25-27(12-16)18-7-15(9-24-11-18)14-2-3-14/h6-12,14,17H,2-5H2,1H3,(H,26,28)
US Patent
n/an/a 1n/an/an/an/an/an/a
Boehringer Ingelheim International GmbH
US Patent
Assay Description
In a 384-well plate, test compound diluted in assay buffer (1% DMSO final) is mixed with 8His-RIPK2 FL enzyme (final concentration of 8 nM). After 15...
US Patent US10138222 (2018)
BindingDB Entry DOI: 10.7270/Q2RV0QS2