null
SMILES: COC1COCCC1N1CCC(CC1)Nc1cncc(c1)-n1cc(cn1)-c1cc(ccc1C)C(=O)NC1CC1
InChI Key: InChIKey=GASXLKNCNCHERH-UHFFFAOYSA-N
Activity Spreadsheet -- Enzyme Inhibition Constant Data from BindingDB
Found 1 hit for monomerid = 303435
Trg + Lig
Ki
nM
ΔG°
kcal/mole
IC50
nM
Kd
nM
EC50/IC50
nM
koff
s-1
kon
M-1s-1
pHTemp
°C
Receptor-interacting serine/threonine-protein kinase 2
(Homo sapiens (Human))
BDBM303435
(US10138222, Example 163)
Show SMILES COC1COCCC1N1CCC(CC1)Nc1cncc(c1)-n1cc(cn1)-c1cc(ccc1C)C(=O)NC1CC1
Show InChI InChI=1S/C30H38N6O3/c1-20-3-4-21(30(37)34-23-5-6-23)13-27(20)22-15-32-36(18-22)26-14-25(16-31-17-26)33-24-7-10-35(11-8-24)28-9-12-39-19-29(28)38-2/h3-4,13-18,23-24,28-29,33H,5-12,19H2,1-2H3,(H,34,37)
US Patent
n/an/a 1.10n/an/an/an/an/an/a
Boehringer Ingelheim International GmbH
US Patent
Assay Description
In a 384-well plate, test compound diluted in assay buffer (1% DMSO final) is mixed with 8His-RIPK2 FL enzyme (final concentration of 8 nM). After 15...
US Patent US10138222 (2018)
BindingDB Entry DOI: 10.7270/Q2RV0QS2