null
SMILES: CO[C@@H]1CN(C)CC[C@@H]1Nc1cncc(c1)-n1cc(cn1)-c1cc(C(=O)NC2CC2)c(F)cc1Cl
InChI Key: InChIKey=RWEMWCNCWJOHHX-BJKOFHAPSA-N
Activity Spreadsheet -- Enzyme Inhibition Constant Data from BindingDB
Found 1 hit for monomerid = 303445
Trg + Lig
Ki
nM
ΔG°
kcal/mole
IC50
nM
Kd
nM
EC50/IC50
nM
koff
s-1
kon
M-1s-1
pHTemp
°C
Receptor-interacting serine/threonine-protein kinase 2
(Homo sapiens (Human))
BDBM303445
(US10138222, Example 173)
Show SMILES CO[C@@H]1CN(C)CC[C@@H]1Nc1cncc(c1)-n1cc(cn1)-c1cc(C(=O)NC2CC2)c(F)cc1Cl |r|
Show InChI InChI=1S/C25H28ClFN6O2/c1-32-6-5-23(24(14-32)35-2)30-17-7-18(12-28-11-17)33-13-15(10-29-33)19-8-20(22(27)9-21(19)26)25(34)31-16-3-4-16/h7-13,16,23-24,30H,3-6,14H2,1-2H3,(H,31,34)/t23-,24+/m0/s1
US Patent
n/an/a 1.80n/an/an/an/an/an/a
Boehringer Ingelheim International GmbH
US Patent
Assay Description
In a 384-well plate, test compound diluted in assay buffer (1% DMSO final) is mixed with 8His-RIPK2 FL enzyme (final concentration of 8 nM). After 15...
US Patent US10138222 (2018)
BindingDB Entry DOI: 10.7270/Q2RV0QS2