BDBM303446 US10138222, Example 174
SMILES: Cc1cc(F)c(cc1-c1cnn(c1)-c1cncc(NC2CCN(CCF)CC2)c1)C(=O)NC1CC1
InChI Key: InChIKey=YOXDNMQCFIZGCC-UHFFFAOYSA-N
Data: 1 IC50
Activity Spreadsheet -- Enzyme Inhibition Constant Data from BindingDB
Found 1 hit for monomerid = 303446
Trg + Lig
Ki
nM
ΔG°
kcal/mole
IC50
nM
Kd
nM
EC50/IC50
nM
koff
s-1
kon
M-1s-1
pHTemp
°C
Receptor-interacting serine/threonine-protein kinase 2
(Homo sapiens (Human))
BDBM303446
(US10138222, Example 174)
Show SMILES Cc1cc(F)c(cc1-c1cnn(c1)-c1cncc(NC2CCN(CCF)CC2)c1)C(=O)NC1CC1
Show InChI InChI=1S/C26H30F2N6O/c1-17-10-25(28)24(26(35)32-19-2-3-19)12-23(17)18-13-30-34(16-18)22-11-21(14-29-15-22)31-20-4-7-33(8-5-20)9-6-27/h10-16,19-20,31H,2-9H2,1H3,(H,32,35)
US Patent
n/an/a 1.5n/an/an/an/an/an/a
Boehringer Ingelheim International GmbH
US Patent
Assay Description
In a 384-well plate, test compound diluted in assay buffer (1% DMSO final) is mixed with 8His-RIPK2 FL enzyme (final concentration of 8 nM). After 15...
US Patent US10138222 (2018)
BindingDB Entry DOI: 10.7270/Q2RV0QS2