BDBM303515 US10138229, Example 29::US10875852, Example 29
SMILES: NC(=O)c1cn(nc1-c1ccc(Oc2ccccc2)cc1)[C@@H]1CCCN(C1)C(=O)C=C
InChI Key: InChIKey=RDMQDOTXHSIKFA-GOSISDBHSA-N
Data: 3 IC50
Activity Spreadsheet -- Enzyme Inhibition Constant Data from BindingDB
Found 3 hits for monomerid = 303515
Trg + Lig
Ki
nM
ΔG°
kcal/mole
IC50
nM
Kd
nM
EC50/IC50
nM
koff
s-1
kon
M-1s-1
pHTemp
°C
Tyrosine-protein kinase BTK
(Homo sapiens (Human))
BDBM303515
(US10138229, Example 29 | US10875852, Example 29)
Show SMILES NC(=O)c1cn(nc1-c1ccc(Oc2ccccc2)cc1)[C@@H]1CCCN(C1)C(=O)C=C |r|
Show InChI InChI=1S/C24H24N4O3/c1-2-22(29)27-14-6-7-18(15-27)28-16-21(24(25)30)23(26-28)17-10-12-20(13-11-17)31-19-8-4-3-5-9-19/h2-5,8-13,16,18H,1,6-7,14-15H2,(H2,25,30)/t18-/m1/s1
NCI pathway
Reactome pathway
US Patent
n/an/a 3.20n/an/an/an/an/an/a
Boehringer Ingelheim International GmbH
US Patent
Assay Description
TBDAn HTRF assay (Cisbio KinEASE-TK cat #62TKOPEC) was performed to quantitate the ability of test compounds to inhibit BTK mediated phosphorylation ...
US Patent US10138229 (2018)
BindingDB Entry DOI: 10.7270/Q2CJ8GJJ
Tyrosine-protein kinase BTK
(Homo sapiens (Human))
BDBM303515
(US10138229, Example 29 | US10875852, Example 29)
Show SMILES NC(=O)c1cn(nc1-c1ccc(Oc2ccccc2)cc1)[C@@H]1CCCN(C1)C(=O)C=C |r|
Show InChI InChI=1S/C24H24N4O3/c1-2-22(29)27-14-6-7-18(15-27)28-16-21(24(25)30)23(26-28)17-10-12-20(13-11-17)31-19-8-4-3-5-9-19/h2-5,8-13,16,18H,1,6-7,14-15H2,(H2,25,30)/t18-/m1/s1
NCI pathway
Reactome pathway
US Patent
n/an/a 3.20n/an/an/an/an/an/a
Boehringer Ingelheim International GmbH
US Patent
Assay Description
An HTRF assay (Cisbio KinEASE-TK cat #62TK0PEC) was performed to quantitate the ability of test compounds to inhibit BTK mediated phosphorylation of ...
US Patent US10875852 (2020)
Tyrosine-protein kinase BTK
(Homo sapiens (Human))
BDBM303515
(US10138229, Example 29 | US10875852, Example 29)
Show SMILES NC(=O)c1cn(nc1-c1ccc(Oc2ccccc2)cc1)[C@@H]1CCCN(C1)C(=O)C=C |r|
Show InChI InChI=1S/C24H24N4O3/c1-2-22(29)27-14-6-7-18(15-27)28-16-21(24(25)30)23(26-28)17-10-12-20(13-11-17)31-19-8-4-3-5-9-19/h2-5,8-13,16,18H,1,6-7,14-15H2,(H2,25,30)/t18-/m1/s1
NCI pathway
Reactome pathway
n/an/a 3.20n/an/an/an/an/an/a
Shandong University
Curated by ChEMBL
Assay Description
Inhibition of human BTK expressed in Sf9 cells using FAM-Srctide peptide substrate incubated for 60 mins by TR-FRET Lantha-screen assay
Bioorg Med Chem Lett 29: 1060-1064 (2019)
Article DOI: 10.1016/j.bmcl.2019.03.005