BDBM303585 US10138229, Example 97::US10875852, Example 97
SMILES:
InChI Key: InChIKey=NZXWRBKGOLYPIY-UHFFFAOYSA-N
Data: 2 IC50
Activity Spreadsheet -- Enzyme Inhibition Constant Data from BindingDB
Found 2 hits for monomerid = 303585
Trg + Lig
Ki
nM
ΔG°
kcal/mole
IC50
nM
Kd
nM
EC50/IC50
nM
koff
s-1
kon
M-1s-1
pHTemp
°C
Tyrosine-protein kinase BTK
(Homo sapiens (Human))
BDBM303585
(US10138229, Example 97 | US10875852, Example 97)
Show InChI InChI=1S/C26H27N5O3/c1-2-21(32)29-17-12-26(13-17)14-18(15-26)31-24(27)22(25(28)33)23(30-31)16-8-10-20(11-9-16)34-19-6-4-3-5-7-19/h2-11,17-18H,1,12-15,27H2,(H2,28,33)(H,29,32)
NCI pathway
Reactome pathway
US Patent
n/an/a 0.800n/an/an/an/an/an/a
Boehringer Ingelheim International GmbH
US Patent
Assay Description
An HTRF assay (Cisbio KinEASE-TK cat #62TK0PEC) was performed to quantitate the ability of test compounds to inhibit BTK mediated phosphorylation of ...
US Patent US10875852 (2020)
Tyrosine-protein kinase BTK
(Homo sapiens (Human))
BDBM303585
(US10138229, Example 97 | US10875852, Example 97)
Show InChI InChI=1S/C26H27N5O3/c1-2-21(32)29-17-12-26(13-17)14-18(15-26)31-24(27)22(25(28)33)23(30-31)16-8-10-20(11-9-16)34-19-6-4-3-5-7-19/h2-11,17-18H,1,12-15,27H2,(H2,28,33)(H,29,32)
NCI pathway
Reactome pathway
US Patent
n/an/a 0.800n/an/an/an/an/an/a
Boehringer Ingelheim International GmbH
US Patent
Assay Description
TBDAn HTRF assay (Cisbio KinEASE-TK cat #62TKOPEC) was performed to quantitate the ability of test compounds to inhibit BTK mediated phosphorylation ...
US Patent US10138229 (2018)
BindingDB Entry DOI: 10.7270/Q2CJ8GJJ