null
SMILES: CC#CC(=O)N1CC[C@@]2(C[C@@H](C2)n2nc(c(C(N)=O)c2N)-c2ccc(OCC(F)(F)F)cc2)C1
InChI Key: InChIKey=AJMAWFQVIBTYSG-VVONHTQRSA-N
Activity Spreadsheet -- Enzyme Inhibition Constant Data from BindingDB
Found 2 hits for monomerid = 303652
Trg + Lig
Ki
nM
ΔG°
kcal/mole
IC50
nM
Kd
nM
EC50/IC50
nM
koff
s-1
kon
M-1s-1
pHTemp
°C
Tyrosine-protein kinase BTK
(Homo sapiens (Human))
BDBM303652
(US10138229, Example 164 | US10875852, Example 164)
Show SMILES CC#CC(=O)N1CC[C@@]2(C[C@@H](C2)n2nc(c(C(N)=O)c2N)-c2ccc(OCC(F)(F)F)cc2)C1 |r,wU:10.12,8.7,wD:8.35,(6.4,-5.83,;5.06,-6.6,;3.73,-7.37,;2.39,-8.14,;2.39,-9.68,;1.06,-7.37,;-.4,-7.85,;-1.31,-6.6,;-.4,-5.35,;-.01,-3.87,;-1.49,-3.47,;-1.89,-4.96,;-2.26,-2.13,;-1.36,-.89,;-2.26,.36,;-3.73,-.12,;-5.06,.65,;-5.06,2.19,;-6.4,-.12,;-3.73,-1.66,;-5.06,-2.43,;-1.86,1.84,;-.38,2.24,;.02,3.73,;-1.07,4.82,;-.67,6.31,;.82,6.71,;1.22,8.19,;.13,9.28,;2.7,8.59,;1.62,9.68,;-2.55,4.42,;-2.95,2.93,;1.06,-5.83,)|
Show InChI InChI=1S/C23H24F3N5O3/c1-2-3-17(32)30-9-8-22(12-30)10-15(11-22)31-20(27)18(21(28)33)19(29-31)14-4-6-16(7-5-14)34-13-23(24,25)26/h4-7,15H,8-13,27H2,1H3,(H2,28,33)/t15-,22-
NCI pathway
Reactome pathway
US Patent
n/an/a 0.5n/an/an/an/an/an/a
Boehringer Ingelheim International GmbH
US Patent
Assay Description
An HTRF assay (Cisbio KinEASE-TK cat #62TK0PEC) was performed to quantitate the ability of test compounds to inhibit BTK mediated phosphorylation of ...
US Patent US10875852 (2020)
Tyrosine-protein kinase BTK
(Homo sapiens (Human))
BDBM303652
(US10138229, Example 164 | US10875852, Example 164)
Show SMILES CC#CC(=O)N1CC[C@@]2(C[C@@H](C2)n2nc(c(C(N)=O)c2N)-c2ccc(OCC(F)(F)F)cc2)C1 |r,wU:10.12,8.7,wD:8.35,(6.4,-5.83,;5.06,-6.6,;3.73,-7.37,;2.39,-8.14,;2.39,-9.68,;1.06,-7.37,;-.4,-7.85,;-1.31,-6.6,;-.4,-5.35,;-.01,-3.87,;-1.49,-3.47,;-1.89,-4.96,;-2.26,-2.13,;-1.36,-.89,;-2.26,.36,;-3.73,-.12,;-5.06,.65,;-5.06,2.19,;-6.4,-.12,;-3.73,-1.66,;-5.06,-2.43,;-1.86,1.84,;-.38,2.24,;.02,3.73,;-1.07,4.82,;-.67,6.31,;.82,6.71,;1.22,8.19,;.13,9.28,;2.7,8.59,;1.62,9.68,;-2.55,4.42,;-2.95,2.93,;1.06,-5.83,)|
Show InChI InChI=1S/C23H24F3N5O3/c1-2-3-17(32)30-9-8-22(12-30)10-15(11-22)31-20(27)18(21(28)33)19(29-31)14-4-6-16(7-5-14)34-13-23(24,25)26/h4-7,15H,8-13,27H2,1H3,(H2,28,33)/t15-,22-
NCI pathway
Reactome pathway
US Patent
n/an/a 0.5n/an/an/an/an/an/a
Boehringer Ingelheim International GmbH
US Patent
Assay Description
TBDAn HTRF assay (Cisbio KinEASE-TK cat #62TKOPEC) was performed to quantitate the ability of test compounds to inhibit BTK mediated phosphorylation ...
US Patent US10138229 (2018)
BindingDB Entry DOI: 10.7270/Q2CJ8GJJ