BDBM30376 piperidinyl glycine derivative, 24m
SMILES: CCOC(=O)N1CCC(CC1)[C@@H](NS(=O)(=O)c1ccc(s1)-c1ccc(OCC)cc1)C(O)=O
InChI Key: InChIKey=VOHDRNMYQAWLKL-HXUWFJFHSA-N
Data: 2 IC50
PDB links: 1 PDB ID contains this monomer as substructures. 1 PDB ID contains inhibitors having a similarity of 90% to this monomer.
Activity Spreadsheet -- Enzyme Inhibition Constant Data from BindingDB
Found 2 hits for monomerid = 30376
Trg + Lig
Ki
nM
ΔG°
kcal/mole
IC50
nM
Kd
nM
EC50/IC50
nM
koff
s-1
kon
M-1s-1
pHTemp
°C
Interstitial collagenase
(Homo sapiens (Human))
BDBM30376
(piperidinyl glycine derivative, 24m)
Show SMILES CCOC(=O)N1CCC(CC1)[C@@H](NS(=O)(=O)c1ccc(s1)-c1ccc(OCC)cc1)C(O)=O |r|
Show InChI InChI=1S/C22H28N2O7S2/c1-3-30-17-7-5-15(6-8-17)18-9-10-19(32-18)33(28,29)23-20(21(25)26)16-11-13-24(14-12-16)22(27)31-4-2/h5-10,16,20,23H,3-4,11-14H2,1-2H3,(H,25,26)/t20-/m1/s1
Reactome pathway
n/an/a>1.00E+4n/an/an/an/an/a25
Novartis
Assay Description
Test compounds were serially diluted in deep well plates, and an aliquot of the inhibitor solutions was transferred to a Biomek deep well plate conta...
J Med Chem 52: 3523-38 (2009)
Article DOI: 10.1021/jm801394m
BindingDB Entry DOI: 10.7270/Q2B27SN3
Collagenase 3
(Homo sapiens (Human))
BDBM30376
(piperidinyl glycine derivative, 24m)
Show SMILES CCOC(=O)N1CCC(CC1)[C@@H](NS(=O)(=O)c1ccc(s1)-c1ccc(OCC)cc1)C(O)=O |r|
Show InChI InChI=1S/C22H28N2O7S2/c1-3-30-17-7-5-15(6-8-17)18-9-10-19(32-18)33(28,29)23-20(21(25)26)16-11-13-24(14-12-16)22(27)31-4-2/h5-10,16,20,23H,3-4,11-14H2,1-2H3,(H,25,26)/t20-/m1/s1
NCI pathway
Reactome pathway
n/an/a 2n/an/an/an/an/a25
Novartis
Assay Description
Test compounds were serially diluted in the assay buffer. In each well of a 96-well microtiter plate (Immunofluor B, Dynatech), the inhibitor solutio...
J Med Chem 52: 3523-38 (2009)
Article DOI: 10.1021/jm801394m
BindingDB Entry DOI: 10.7270/Q2B27SN3