BDBM30379 piperidinyl glycine derivative, 24p
SMILES: CCOc1ccc(cc1)-c1ccc(s1)S(=O)(=O)N[C@H](C1CCN(CC1)C(=O)OCC(C)C)C(O)=O
InChI Key: InChIKey=VZIBNJOTVVYOSZ-JOCHJYFZSA-N
Data: 2 IC50
Activity Spreadsheet -- Enzyme Inhibition Constant Data from BindingDB
Found 2 hits for monomerid = 30379
Trg + Lig
Ki
nM
ΔG°
kcal/mole
IC50
nM
Kd
nM
EC50/IC50
nM
koff
s-1
kon
M-1s-1
pHTemp
°C
Interstitial collagenase
(Homo sapiens (Human))
BDBM30379
(piperidinyl glycine derivative, 24p)
Show SMILES CCOc1ccc(cc1)-c1ccc(s1)S(=O)(=O)N[C@H](C1CCN(CC1)C(=O)OCC(C)C)C(O)=O |r|
Show InChI InChI=1S/C24H32N2O7S2/c1-4-32-19-7-5-17(6-8-19)20-9-10-21(34-20)35(30,31)25-22(23(27)28)18-11-13-26(14-12-18)24(29)33-15-16(2)3/h5-10,16,18,22,25H,4,11-15H2,1-3H3,(H,27,28)/t22-/m1/s1
Reactome pathway
n/an/a>1.00E+4n/an/an/an/an/a25
Novartis
Assay Description
Test compounds were serially diluted in deep well plates, and an aliquot of the inhibitor solutions was transferred to a Biomek deep well plate conta...
J Med Chem 52: 3523-38 (2009)
Article DOI: 10.1021/jm801394m
BindingDB Entry DOI: 10.7270/Q2B27SN3
Collagenase 3
(Homo sapiens (Human))
BDBM30379
(piperidinyl glycine derivative, 24p)
Show SMILES CCOc1ccc(cc1)-c1ccc(s1)S(=O)(=O)N[C@H](C1CCN(CC1)C(=O)OCC(C)C)C(O)=O |r|
Show InChI InChI=1S/C24H32N2O7S2/c1-4-32-19-7-5-17(6-8-19)20-9-10-21(34-20)35(30,31)25-22(23(27)28)18-11-13-26(14-12-18)24(29)33-15-16(2)3/h5-10,16,18,22,25H,4,11-15H2,1-3H3,(H,27,28)/t22-/m1/s1
NCI pathway
Reactome pathway
n/an/a 0.600n/an/an/an/an/a25
Novartis
Assay Description
Test compounds were serially diluted in the assay buffer. In each well of a 96-well microtiter plate (Immunofluor B, Dynatech), the inhibitor solutio...
J Med Chem 52: 3523-38 (2009)
Article DOI: 10.1021/jm801394m
BindingDB Entry DOI: 10.7270/Q2B27SN3