BDBM30381 piperidinyl glycine derivative, 24r
SMILES: CCOc1ccc(cc1)-c1ccc(s1)S(=O)(=O)N[C@H](C1CCN(CC1)C(=O)OCC(C)(C)C)C(O)=O
InChI Key: InChIKey=UFVAMNFOSNVREZ-JOCHJYFZSA-N
Data: 2 IC50
Activity Spreadsheet -- Enzyme Inhibition Constant Data from BindingDB
Found 2 hits for monomerid = 30381
Trg + Lig
Ki
nM
ΔG°
kcal/mole
IC50
nM
Kd
nM
EC50/IC50
nM
koff
s-1
kon
M-1s-1
pHTemp
°C
Interstitial collagenase
(Homo sapiens (Human))
BDBM30381
(piperidinyl glycine derivative, 24r)
Show SMILES CCOc1ccc(cc1)-c1ccc(s1)S(=O)(=O)N[C@H](C1CCN(CC1)C(=O)OCC(C)(C)C)C(O)=O |r|
Show InChI InChI=1S/C25H34N2O7S2/c1-5-33-19-8-6-17(7-9-19)20-10-11-21(35-20)36(31,32)26-22(23(28)29)18-12-14-27(15-13-18)24(30)34-16-25(2,3)4/h6-11,18,22,26H,5,12-16H2,1-4H3,(H,28,29)/t22-/m1/s1
Reactome pathway
n/an/a>1.00E+4n/an/an/an/an/a25
Novartis
Assay Description
Test compounds were serially diluted in deep well plates, and an aliquot of the inhibitor solutions was transferred to a Biomek deep well plate conta...
J Med Chem 52: 3523-38 (2009)
Article DOI: 10.1021/jm801394m
BindingDB Entry DOI: 10.7270/Q2B27SN3
Collagenase 3
(Homo sapiens (Human))
BDBM30381
(piperidinyl glycine derivative, 24r)
Show SMILES CCOc1ccc(cc1)-c1ccc(s1)S(=O)(=O)N[C@H](C1CCN(CC1)C(=O)OCC(C)(C)C)C(O)=O |r|
Show InChI InChI=1S/C25H34N2O7S2/c1-5-33-19-8-6-17(7-9-19)20-10-11-21(35-20)36(31,32)26-22(23(28)29)18-12-14-27(15-13-18)24(30)34-16-25(2,3)4/h6-11,18,22,26H,5,12-16H2,1-4H3,(H,28,29)/t22-/m1/s1
NCI pathway
Reactome pathway
n/an/a 0.900n/an/an/an/an/a25
Novartis
Assay Description
Test compounds were serially diluted in the assay buffer. In each well of a 96-well microtiter plate (Immunofluor B, Dynatech), the inhibitor solutio...
J Med Chem 52: 3523-38 (2009)
Article DOI: 10.1021/jm801394m
BindingDB Entry DOI: 10.7270/Q2B27SN3