BDBM30382 piperidinyl glycine derivative, 24s
SMILES: CCOc1ccc(cc1)-c1ccc(s1)S(=O)(=O)N[C@H](C1CCN(CC1)C(=O)OC(C)(C)C)C(O)=O
InChI Key: InChIKey=WCUFVZOKFLTYIS-OAQYLSRUSA-N
Data: 2 IC50
Activity Spreadsheet -- Enzyme Inhibition Constant Data from BindingDB
Found 2 hits for monomerid = 30382
Trg + Lig
Ki
nM
ΔG°
kcal/mole
IC50
nM
Kd
nM
EC50/IC50
nM
koff
s-1
kon
M-1s-1
pHTemp
°C
Interstitial collagenase
(Homo sapiens (Human))
BDBM30382
(piperidinyl glycine derivative, 24s)
Show SMILES CCOc1ccc(cc1)-c1ccc(s1)S(=O)(=O)N[C@H](C1CCN(CC1)C(=O)OC(C)(C)C)C(O)=O |r|
Show InChI InChI=1S/C24H32N2O7S2/c1-5-32-18-8-6-16(7-9-18)19-10-11-20(34-19)35(30,31)25-21(22(27)28)17-12-14-26(15-13-17)23(29)33-24(2,3)4/h6-11,17,21,25H,5,12-15H2,1-4H3,(H,27,28)/t21-/m1/s1
Reactome pathway
n/an/a>1.00E+4n/an/an/an/an/a25
Novartis
Assay Description
Test compounds were serially diluted in deep well plates, and an aliquot of the inhibitor solutions was transferred to a Biomek deep well plate conta...
J Med Chem 52: 3523-38 (2009)
Article DOI: 10.1021/jm801394m
BindingDB Entry DOI: 10.7270/Q2B27SN3
Collagenase 3
(Homo sapiens (Human))
BDBM30382
(piperidinyl glycine derivative, 24s)
Show SMILES CCOc1ccc(cc1)-c1ccc(s1)S(=O)(=O)N[C@H](C1CCN(CC1)C(=O)OC(C)(C)C)C(O)=O |r|
Show InChI InChI=1S/C24H32N2O7S2/c1-5-32-18-8-6-16(7-9-18)19-10-11-20(34-19)35(30,31)25-21(22(27)28)17-12-14-26(15-13-17)23(29)33-24(2,3)4/h6-11,17,21,25H,5,12-15H2,1-4H3,(H,27,28)/t21-/m1/s1
NCI pathway
Reactome pathway
n/an/a 0.600n/an/an/an/an/a25
Novartis
Assay Description
Test compounds were serially diluted in the assay buffer. In each well of a 96-well microtiter plate (Immunofluor B, Dynatech), the inhibitor solutio...
J Med Chem 52: 3523-38 (2009)
Article DOI: 10.1021/jm801394m
BindingDB Entry DOI: 10.7270/Q2B27SN3