BDBM30387 piperidinyl glycine derivative, 25c
SMILES: CCOc1ccc(cc1)-c1ccc(s1)S(=O)(=O)N[C@H](C1CCN(CC1)C(=O)NC(C)C)C(O)=O
InChI Key: InChIKey=JWKIHGMBZXIUII-OAQYLSRUSA-N
Data: 2 IC50
Activity Spreadsheet -- Enzyme Inhibition Constant Data from BindingDB
Found 2 hits for monomerid = 30387
Trg + Lig
Ki
nM
ΔG°
kcal/mole
IC50
nM
Kd
nM
EC50/IC50
nM
koff
s-1
kon
M-1s-1
pHTemp
°C
Interstitial collagenase
(Homo sapiens (Human))
BDBM30387
(piperidinyl glycine derivative, 25c)
Show SMILES CCOc1ccc(cc1)-c1ccc(s1)S(=O)(=O)N[C@H](C1CCN(CC1)C(=O)NC(C)C)C(O)=O |r|
Show InChI InChI=1S/C23H31N3O6S2/c1-4-32-18-7-5-16(6-8-18)19-9-10-20(33-19)34(30,31)25-21(22(27)28)17-11-13-26(14-12-17)23(29)24-15(2)3/h5-10,15,17,21,25H,4,11-14H2,1-3H3,(H,24,29)(H,27,28)/t21-/m1/s1
Reactome pathway
n/an/a 6.56E+3n/an/an/an/an/a25
Novartis
Assay Description
Test compounds were serially diluted in deep well plates, and an aliquot of the inhibitor solutions was transferred to a Biomek deep well plate conta...
J Med Chem 52: 3523-38 (2009)
Article DOI: 10.1021/jm801394m
BindingDB Entry DOI: 10.7270/Q2B27SN3
Collagenase 3
(Homo sapiens (Human))
BDBM30387
(piperidinyl glycine derivative, 25c)
Show SMILES CCOc1ccc(cc1)-c1ccc(s1)S(=O)(=O)N[C@H](C1CCN(CC1)C(=O)NC(C)C)C(O)=O |r|
Show InChI InChI=1S/C23H31N3O6S2/c1-4-32-18-7-5-16(6-8-18)19-9-10-20(33-19)34(30,31)25-21(22(27)28)17-11-13-26(14-12-17)23(29)24-15(2)3/h5-10,15,17,21,25H,4,11-14H2,1-3H3,(H,24,29)(H,27,28)/t21-/m1/s1
NCI pathway
Reactome pathway
n/an/a 0.800n/an/an/an/an/a25
Novartis
Assay Description
Test compounds were serially diluted in the assay buffer. In each well of a 96-well microtiter plate (Immunofluor B, Dynatech), the inhibitor solutio...
J Med Chem 52: 3523-38 (2009)
Article DOI: 10.1021/jm801394m
BindingDB Entry DOI: 10.7270/Q2B27SN3