BDBM30388 piperidinyl glycine derivative, 25d
SMILES: CCN(CC)C(=O)N1CCC(CC1)[C@@H](NS(=O)(=O)c1ccc(s1)-c1ccc(OC)cc1)C(O)=O
InChI Key: InChIKey=KHZOOCSTBFXVQU-OAQYLSRUSA-N
Data: 2 IC50
Activity Spreadsheet -- Enzyme Inhibition Constant Data from BindingDB
Found 2 hits for monomerid = 30388
Trg + Lig
Ki
nM
ΔG°
kcal/mole
IC50
nM
Kd
nM
EC50/IC50
nM
koff
s-1
kon
M-1s-1
pHTemp
°C
Interstitial collagenase
(Homo sapiens (Human))
BDBM30388
(piperidinyl glycine derivative, 25d)
Show SMILES CCN(CC)C(=O)N1CCC(CC1)[C@@H](NS(=O)(=O)c1ccc(s1)-c1ccc(OC)cc1)C(O)=O |r|
Show InChI InChI=1S/C23H31N3O6S2/c1-4-25(5-2)23(29)26-14-12-17(13-15-26)21(22(27)28)24-34(30,31)20-11-10-19(33-20)16-6-8-18(32-3)9-7-16/h6-11,17,21,24H,4-5,12-15H2,1-3H3,(H,27,28)/t21-/m1/s1
Reactome pathway
n/an/a 2.30E+3n/an/an/an/an/a25
Novartis
Assay Description
Test compounds were serially diluted in deep well plates, and an aliquot of the inhibitor solutions was transferred to a Biomek deep well plate conta...
J Med Chem 52: 3523-38 (2009)
Article DOI: 10.1021/jm801394m
BindingDB Entry DOI: 10.7270/Q2B27SN3
Collagenase 3
(Homo sapiens (Human))
BDBM30388
(piperidinyl glycine derivative, 25d)
Show SMILES CCN(CC)C(=O)N1CCC(CC1)[C@@H](NS(=O)(=O)c1ccc(s1)-c1ccc(OC)cc1)C(O)=O |r|
Show InChI InChI=1S/C23H31N3O6S2/c1-4-25(5-2)23(29)26-14-12-17(13-15-26)21(22(27)28)24-34(30,31)20-11-10-19(33-20)16-6-8-18(32-3)9-7-16/h6-11,17,21,24H,4-5,12-15H2,1-3H3,(H,27,28)/t21-/m1/s1
NCI pathway
Reactome pathway
n/an/a 2.80n/an/an/an/an/a25
Novartis
Assay Description
Test compounds were serially diluted in the assay buffer. In each well of a 96-well microtiter plate (Immunofluor B, Dynatech), the inhibitor solutio...
J Med Chem 52: 3523-38 (2009)
Article DOI: 10.1021/jm801394m
BindingDB Entry DOI: 10.7270/Q2B27SN3