BDBM303906 N-Cyclopropyl-5-{1-[6-(1-dimethylcarbamoylmethyl-piperidin-4-yl)-imidazo[1,2-a]pyridin-3-yl]-1H-pyrazol-4-yl}-2-fluoro-4-methyl-benzamide::US10138241, Example 93
SMILES: CN(C)C(=O)CN1CCC(CC1)c1ccc2ncc(-n3cc(cn3)-c3cc(C(=O)NC4CC4)c(F)cc3C)n2c1
InChI Key: InChIKey=JDTCTDOPJYCGKR-UHFFFAOYSA-N
Data: 1 IC50
Activity Spreadsheet -- Enzyme Inhibition Constant Data from BindingDB
Found 1 hit for monomerid = 303906
Trg + Lig
Ki
nM
ΔG°
kcal/mole
IC50
nM
Kd
nM
EC50/IC50
nM
koff
s-1
kon
M-1s-1
pHTemp
°C
Serine/threonine-protein kinase RIPK2
(Homo sapiens (Human))
BDBM303906
(N-Cyclopropyl-5-{1-[6-(1-dimethylcarbamoylmethyl-p...)
Show SMILES CN(C)C(=O)CN1CCC(CC1)c1ccc2ncc(-n3cc(cn3)-c3cc(C(=O)NC4CC4)c(F)cc3C)n2c1
Show InChI InChI=1S/C30H34FN7O2/c1-19-12-26(31)25(30(40)34-23-5-6-23)13-24(19)22-14-33-38(17-22)28-15-32-27-7-4-21(16-37(27)28)20-8-10-36(11-9-20)18-29(39)35(2)3/h4,7,12-17,20,23H,5-6,8-11,18H2,1-3H3,(H,34,40)
US Patent
n/an/a 1.5n/an/an/an/an/an/a
Boehringer Ingelheim International GmbH
US Patent
Assay Description
In a 384-well plate, test compound diluted in assay buffer (1% DMSO final) is mixed with 8His-RIPK2 FL enzyme (final concentration of 8 nM). After 15...
US Patent US10138241 (2018)
BindingDB Entry DOI: 10.7270/Q2VM4FBZ