BDBM30407 5-hydroxy- 3(2H)-pyridazinone, 2::BMCL185002 Compound 1
SMILES: CC(C)CCn1nc(-c2cccs2)c(O)c(C2=Nc3ccc(NS(C)(=O)=O)cc3S(=O)(=O)N2)c1=O
InChI Key: InChIKey=UNKTYNIAIAATDF-UHFFFAOYSA-N
Data: 2 IC50  2 EC50
PDB links: 1 PDB ID matches this monomer.
Activity Spreadsheet -- Enzyme Inhibition Constant Data from BindingDB
Found 2 hits for monomerid = 30407
Trg + Lig
Ki
nM
ΔG°
kcal/mole
IC50
nM
Kd
nM
EC50/IC50
nM
koff
s-1
kon
M-1s-1
pHTemp
°C
Non-structural protein 5B (NS5B)
(Hepatitis C virus genotype 1b (isolate BK) (HCV))
BDBM30407
(5-hydroxy- 3(2H)-pyridazinone, 2 | BMCL185002 Comp...)
Show SMILES CC(C)CCn1nc(-c2cccs2)c(O)c(C2=Nc3ccc(NS(C)(=O)=O)cc3S(=O)(=O)N2)c1=O |t:17|
Show InChI InChI=1S/C21H23N5O6S3/c1-12(2)8-9-26-21(28)17(19(27)18(23-26)15-5-4-10-33-15)20-22-14-7-6-13(24-34(3,29)30)11-16(14)35(31,32)25-20/h4-7,10-12,24,27H,8-9H2,1-3H3,(H,22,25)
n/an/a<10n/a 5n/an/a7.528
Anadys Pharmaceuticals
Assay Description
Assays were performed in a 96-well streptavidin-coated Flash-Plate using enzyme, RNA substrate, and [alpha-33P]GTP/GTP with inhibitor concentration v...
Bioorg Med Chem Lett 18: 5002-5 (2008)
Article DOI: 10.1016/j.bmcl.2008.08.017
BindingDB Entry DOI: 10.7270/Q2XW4H5X
3D
3D Structure (crystal)
Non-structural protein 5B (NS5B)
(Hepatitis C virus genotype 1b (isolate BK) (HCV))
BDBM30407
(5-hydroxy- 3(2H)-pyridazinone, 2 | BMCL185002 Comp...)
Show SMILES CC(C)CCn1nc(-c2cccs2)c(O)c(C2=Nc3ccc(NS(C)(=O)=O)cc3S(=O)(=O)N2)c1=O |t:17|
Show InChI InChI=1S/C21H23N5O6S3/c1-12(2)8-9-26-21(28)17(19(27)18(23-26)15-5-4-10-33-15)20-22-14-7-6-13(24-34(3,29)30)11-16(14)35(31,32)25-20/h4-7,10-12,24,27H,8-9H2,1-3H3,(H,22,25)
n/an/a<10n/a 5n/an/a7.528
Anadys Pharmaceuticals
Assay Description
Assays were performed in a 96-well streptavidin-coated Flash-Plate using enzyme, RNA substrate, and [alpha-33P]GTP/GTP with inhibitor concentration v...
Bioorg Med Chem Lett 18: 3616-21 (2008)
Article DOI: 10.1016/j.bmcl.2008.04.066
BindingDB Entry DOI: 10.7270/Q26D5R9N
3D
3D Structure (crystal)