BDBM304357 US10143668, Compound 1c
SMILES: CCCCCCCCCCCCN(C)CC(=O)N(C)C[C@H](O)[C@@H](O)[C@H](O)[C@H](O)CO
InChI Key: InChIKey=OEWDPHNWDJTDTM-YVNJGZBMSA-N
Data: 1 IC50
Activity Spreadsheet -- Enzyme Inhibition Constant Data from BindingDB
Found 1 hit for monomerid = 304357
Trg + Lig
Ki
nM
ΔG°
kcal/mole
IC50
nM
Kd
nM
EC50/IC50
nM
koff
s-1
kon
M-1s-1
pHTemp
°C
Beta-hexosaminidase subunit beta
(Homo sapiens (Human))
BDBM304357
(US10143668, Compound 1c)
Show SMILES CCCCCCCCCCCCN(C)CC(=O)N(C)C[C@H](O)[C@@H](O)[C@H](O)[C@H](O)CO |r|
Show InChI InChI=1S/C22H46N2O6/c1-4-5-6-7-8-9-10-11-12-13-14-23(2)16-20(28)24(3)15-18(26)21(29)22(30)19(27)17-25/h18-19,21-22,25-27,29-30H,4-17H2,1-3H3/t18-,19+,21+,22+/m0/s1
Reactome pathway
US Patent
n/an/a 1.23E+4n/an/an/an/an/an/a
GRI BIO, INC.
US Patent
Assay Description
Buffers and solutions: Phosphate buffered saline (PBS) and 1 M HEPES were provided by the in-house service facility. Tyrode's buffer (TyB) consis...
US Patent US10143668 (2018)
BindingDB Entry DOI: 10.7270/Q2K35WQ0