null
SMILES: CC(C)CCN1N2CCCC2C(=O)C(C2=Nc3ccc(NS(C)(=O)=O)cc3S(=O)(=O)N2)C1=O
InChI Key: InChIKey=BSQGXDAREJXWLU-UHFFFAOYSA-N
Activity Spreadsheet -- Enzyme Inhibition Constant Data from BindingDB
Found 1 hit for monomerid = 30451
Trg + Lig
Ki
nM
ΔG°
kcal/mole
IC50
nM
Kd
nM
EC50/IC50
nM
koff
s-1
kon
M-1s-1
pHTemp
°C
Genome polyprotein
(Hepatitis C virus genotype 1b (isolate BK) (HCV))
BDBM30451
(hexahydro-pyrrolo[1,2-b]pyridazin-2-one, 4b)
Show SMILES CC(C)CCN1N2CCCC2C(=O)C(C2=Nc3ccc(NS(C)(=O)=O)cc3S(=O)(=O)N2)C1=O |t:15|
Show InChI InChI=1S/C20H27N5O6S2/c1-12(2)8-10-25-20(27)17(18(26)15-5-4-9-24(15)25)19-21-14-7-6-13(22-32(3,28)29)11-16(14)33(30,31)23-19/h6-7,11-12,15,17,22H,4-5,8-10H2,1-3H3,(H,21,23)
n/an/a 12n/a 160n/an/a7.528
Anadys Pharmaceuticals
Assay Description
Assays were performed in a 96-well streptavidin-coated Flash-Plate using enzyme, RNA substrate, and [alpha-33P]GTP/GTP with inhibitor concentration v...
Bioorg Med Chem Lett 18: 5002-5 (2008)
Article DOI: 10.1016/j.bmcl.2008.08.017
BindingDB Entry DOI: 10.7270/Q2XW4H5X