BDBM30458 benzothiazine-containing analog, 3b
SMILES: CCC(C)(C)CCn1nc(-c2cccs2)c(O)c(C2=Nc3ccc(NS(C)(=O)=O)cc3S(=O)(=O)C2)c1=O
InChI Key: InChIKey=MBKPHWOAEUPUHE-UHFFFAOYSA-N
Data: 1 IC50  1 EC50
Activity Spreadsheet -- Enzyme Inhibition Constant Data from BindingDB
Found 1 hit for monomerid = 30458
Trg + Lig
Ki
nM
ΔG°
kcal/mole
IC50
nM
Kd
nM
EC50/IC50
nM
koff
s-1
kon
M-1s-1
pHTemp
°C
Non-structural protein 5B (NS5B)
(Hepatitis C virus genotype 1b (isolate BK) (HCV))
BDBM30458
(benzothiazine-containing analog, 3b)
Show SMILES CCC(C)(C)CCn1nc(-c2cccs2)c(O)c(C2=Nc3ccc(NS(C)(=O)=O)cc3S(=O)(=O)C2)c1=O |t:19|
Show InChI InChI=1S/C24H28N4O6S3/c1-5-24(2,3)10-11-28-23(30)20(22(29)21(26-28)18-7-6-12-35-18)17-14-37(33,34)19-13-15(27-36(4,31)32)8-9-16(19)25-17/h6-9,12-13,27,29H,5,10-11,14H2,1-4H3
n/an/a<10n/a 2.70n/an/a7.528
Anadys Pharmaceuticals
Assay Description
Assays were performed in a 96-well streptavidin-coated Flash-Plate using enzyme, RNA substrate, and [alpha-33P]GTP/GTP with inhibitor concentration v...
Bioorg Med Chem Lett 18: 4628-32 (2008)
Article DOI: 10.1016/j.bmcl.2008.07.014
BindingDB Entry DOI: 10.7270/Q2T43RFH