BDBM30471 1,1-dioxoisothiazole analog., 15
SMILES: CC(C)[C@@H]1N(Cc2ccccc2)C(=O)C(C1=O)=C1NS(=O)(=O)c2c1cccc2O
InChI Key: InChIKey=WXNXFHZTGHENAE-SFHVURJKSA-N
Data: 1 IC50  1 EC50
Activity Spreadsheet -- Enzyme Inhibition Constant Data from BindingDB
Found 1 hit for monomerid = 30471
Trg + Lig
Ki
nM
ΔG°
kcal/mole
IC50
nM
Kd
nM
EC50/IC50
nM
koff
s-1
kon
M-1s-1
pHTemp
°C
Non-structural protein 5B (NS5B)
(Hepatitis C virus genotype 1b (isolate BK) (HCV))
BDBM30471
(1,1-dioxoisothiazole analog., 15)
Show SMILES CC(C)[C@@H]1N(Cc2ccccc2)C(=O)C(C1=O)=C1NS(=O)(=O)c2c1cccc2O |r,w:14.15|
Show InChI InChI=1S/C21H20N2O5S/c1-12(2)18-19(25)16(21(26)23(18)11-13-7-4-3-5-8-13)17-14-9-6-10-15(24)20(14)29(27,28)22-17/h3-10,12,18,22,24H,11H2,1-2H3/t18-/m0/s1
n/an/a 470n/a 4.70E+4n/an/a7.528
Anadys Pharmaceuticals
Assay Description
Assays were performed in a 96-well streptavidin-coated Flash-Plate using enzyme, RNA substrate, and [alpha-33P]GTP/GTP with inhibitor concentration v...
Bioorg Med Chem Lett 18: 4181-5 (2008)
Article DOI: 10.1016/j.bmcl.2008.05.083
BindingDB Entry DOI: 10.7270/Q2PC30Q5