BDBM30472 1,1-dioxoisothiazole analog., 16
SMILES: CC(C)[C@@H]1N(Cc2ccccc2)C(=O)C(C1=O)=C1NS(=O)(=O)c2c1cccc2OCC(N)=O
InChI Key: InChIKey=LWMDTNRVVSEEKN-FQEVSTJZSA-N
Data: 1 IC50  1 EC50
Activity Spreadsheet -- Enzyme Inhibition Constant Data from BindingDB
Found 1 hit for monomerid = 30472
Trg + Lig
Ki
nM
ΔG°
kcal/mole
IC50
nM
Kd
nM
EC50/IC50
nM
koff
s-1
kon
M-1s-1
pHTemp
°C
Non-structural protein 5B (NS5B)
(Hepatitis C virus genotype 1b (isolate BK) (HCV))
BDBM30472
(1,1-dioxoisothiazole analog., 16)
Show SMILES CC(C)[C@@H]1N(Cc2ccccc2)C(=O)C(C1=O)=C1NS(=O)(=O)c2c1cccc2OCC(N)=O |r,w:14.15|
Show InChI InChI=1S/C23H23N3O6S/c1-13(2)20-21(28)18(23(29)26(20)11-14-7-4-3-5-8-14)19-15-9-6-10-16(32-12-17(24)27)22(15)33(30,31)25-19/h3-10,13,20,25H,11-12H2,1-2H3,(H2,24,27)/t20-/m0/s1
n/an/a 520n/a 8.80E+4n/an/a7.528
Anadys Pharmaceuticals
Assay Description
Assays were performed in a 96-well streptavidin-coated Flash-Plate using enzyme, RNA substrate, and [alpha-33P]GTP/GTP with inhibitor concentration v...
Bioorg Med Chem Lett 18: 4181-5 (2008)
Article DOI: 10.1016/j.bmcl.2008.05.083
BindingDB Entry DOI: 10.7270/Q2PC30Q5