BDBM30476 1,1-dioxoisothiazole analog., 20
SMILES: CC(C)[C@@H]1N(Cc2ccccc2)C(=O)C(C1=O)=C1NS(=O)(=O)c2c1cccc2OCC(=O)N1CCOCC1
InChI Key: InChIKey=GWTVRMOYICQSNJ-DEOSSOPVSA-N
Data: 1 IC50  1 EC50
Activity Spreadsheet -- Enzyme Inhibition Constant Data from BindingDB
Found 1 hit for monomerid = 30476
Trg + Lig
Ki
nM
ΔG°
kcal/mole
IC50
nM
Kd
nM
EC50/IC50
nM
koff
s-1
kon
M-1s-1
pHTemp
°C
Genome polyprotein
(Hepatitis C virus genotype 1b (isolate BK) (HCV))
BDBM30476
(1,1-dioxoisothiazole analog., 20)
Show SMILES CC(C)[C@@H]1N(Cc2ccccc2)C(=O)C(C1=O)=C1NS(=O)(=O)c2c1cccc2OCC(=O)N1CCOCC1 |r,w:14.15|
Show InChI InChI=1S/C27H29N3O7S/c1-17(2)24-25(32)22(27(33)30(24)15-18-7-4-3-5-8-18)23-19-9-6-10-20(26(19)38(34,35)28-23)37-16-21(31)29-11-13-36-14-12-29/h3-10,17,24,28H,11-16H2,1-2H3/t24-/m0/s1
n/an/a 3.20E+3n/a>3.30E+4n/an/a7.528
Anadys Pharmaceuticals
Assay Description
Assays were performed in a 96-well streptavidin-coated Flash-Plate using enzyme, RNA substrate, and [alpha-33P]GTP/GTP with inhibitor concentration v...
Bioorg Med Chem Lett 18: 4181-5 (2008)
Article DOI: 10.1016/j.bmcl.2008.05.083
BindingDB Entry DOI: 10.7270/Q2PC30Q5