BDBM30507 5,6-Dihydro-1H-pyridin-2-one, 4g
SMILES: CS(=O)(=O)Nc1ccc2N=C(NS(=O)(=O)c2c1)C1C(=O)C2CCCCCCC2N(Cc2ccc(F)cc2)C1=O
InChI Key: InChIKey=JFSHEWWTWNTZAT-UHFFFAOYSA-N
Data: 2 IC50  1 EC50
Activity Spreadsheet -- Enzyme Inhibition Constant Data from BindingDB
Found 2 hits for monomerid = 30507
Trg + Lig
Ki
nM
ΔG°
kcal/mole
IC50
nM
Kd
nM
EC50/IC50
nM
koff
s-1
kon
M-1s-1
pHTemp
°C
HCV NS3-NS4A Serine Proteinase
(Hepatitis C virus (HCV genotype 1a, isolate H))
BDBM30507
(5,6-Dihydro-1H-pyridin-2-one, 4g)
Show SMILES CS(=O)(=O)Nc1ccc2N=C(NS(=O)(=O)c2c1)C1C(=O)C2CCCCCCC2N(Cc2ccc(F)cc2)C1=O |c:9|
Show InChI InChI=1S/C26H29FN4O6S2/c1-38(34,35)29-18-12-13-20-22(14-18)39(36,37)30-25(28-20)23-24(32)19-6-4-2-3-5-7-21(19)31(26(23)33)15-16-8-10-17(27)11-9-16/h8-14,19,21,23,29H,2-7,15H2,1H3,(H,28,30)
n/an/a 1.00E+3n/an/an/an/an/an/a
Anadys Pharmaceuticals
Assay Description
Assays were performed in a 96-well streptavidin-coated Flash-Plate using enzyme (NS5B H77 1a), RNA substrate, and [alpha-33P]GTP/GTP with inhibitor c...
Bioorg Med Chem Lett 19: 451-8 (2009)
Article DOI: 10.1016/j.bmcl.2008.11.048
BindingDB Entry DOI: 10.7270/Q2JM27Z0
Non-structural protein 5B (NS5B)
(Hepatitis C virus genotype 1b (isolate BK) (HCV))
BDBM30507
(5,6-Dihydro-1H-pyridin-2-one, 4g)
Show SMILES CS(=O)(=O)Nc1ccc2N=C(NS(=O)(=O)c2c1)C1C(=O)C2CCCCCCC2N(Cc2ccc(F)cc2)C1=O |c:9|
Show InChI InChI=1S/C26H29FN4O6S2/c1-38(34,35)29-18-12-13-20-22(14-18)39(36,37)30-25(28-20)23-24(32)19-6-4-2-3-5-7-21(19)31(26(23)33)15-16-8-10-17(27)11-9-16/h8-14,19,21,23,29H,2-7,15H2,1H3,(H,28,30)
n/an/a 130n/a 7.30E+3n/an/a7.528
Anadys Pharmaceuticals
Assay Description
Assays were performed in a 96-well streptavidin-coated Flash-Plate using enzyme, RNA substrate, and [alpha-33P]GTP/GTP with inhibitor concentration v...
Bioorg Med Chem Lett 19: 451-8 (2009)
Article DOI: 10.1016/j.bmcl.2008.11.048
BindingDB Entry DOI: 10.7270/Q2JM27Z0