null
SMILES: [H][C@@]12CCCC[C@]1([H])C(=O)C(C(=O)N2Cc1ccc(F)cc1)C1=Nc2ccc(NS(C)(=O)=O)cc2S(=O)(=O)N1
InChI Key: InChIKey=GPSMZISPBDHPAR-FOHCZPNYSA-N
Activity Spreadsheet -- Enzyme Inhibition Constant Data from BindingDB
Found 2 hits for monomerid = 30535
Trg + Lig
Ki
nM
ΔG°
kcal/mole
IC50
nM
Kd
nM
EC50/IC50
nM
koff
s-1
kon
M-1s-1
pHTemp
°C
Genome polyprotein
(Hepatitis C virus (HCV genotype 1a, isolate H))
BDBM30535
(5,6-Dihydro-1H-pyridin-2-one, 4ag)
Show SMILES [H][C@@]12CCCC[C@]1([H])C(=O)C(C(=O)N2Cc1ccc(F)cc1)C1=Nc2ccc(NS(C)(=O)=O)cc2S(=O)(=O)N1 |r,t:25|
Show InChI InChI=1S/C24H25FN4O6S2/c1-36(32,33)27-16-10-11-18-20(12-16)37(34,35)28-23(26-18)21-22(30)17-4-2-3-5-19(17)29(24(21)31)13-14-6-8-15(25)9-7-14/h6-12,17,19,21,27H,2-5,13H2,1H3,(H,26,28)/t17-,19+,21?/m0/s1
n/an/a 43n/an/an/an/an/an/a
Anadys Pharmaceuticals
Assay Description
Assays were performed in a 96-well streptavidin-coated Flash-Plate using enzyme (NS5B H77 1a), RNA substrate, and [alpha-33P]GTP/GTP with inhibitor c...
Bioorg Med Chem Lett 19: 451-8 (2009)
Article DOI: 10.1016/j.bmcl.2008.11.048
BindingDB Entry DOI: 10.7270/Q2JM27Z0
Genome polyprotein
(Hepatitis C virus genotype 1b (isolate BK) (HCV))
BDBM30535
(5,6-Dihydro-1H-pyridin-2-one, 4ag)
Show SMILES [H][C@@]12CCCC[C@]1([H])C(=O)C(C(=O)N2Cc1ccc(F)cc1)C1=Nc2ccc(NS(C)(=O)=O)cc2S(=O)(=O)N1 |r,t:25|
Show InChI InChI=1S/C24H25FN4O6S2/c1-36(32,33)27-16-10-11-18-20(12-16)37(34,35)28-23(26-18)21-22(30)17-4-2-3-5-19(17)29(24(21)31)13-14-6-8-15(25)9-7-14/h6-12,17,19,21,27H,2-5,13H2,1H3,(H,26,28)/t17-,19+,21?/m0/s1
n/an/a 47n/a 350n/an/an/an/a
Anadys Pharmaceuticals
Assay Description
Assays were performed in a 96-well streptavidin-coated Flash-Plate using enzyme, RNA substrate, and [alpha-33P]GTP/GTP with inhibitor concentration v...
Bioorg Med Chem Lett 19: 451-8 (2009)
Article DOI: 10.1016/j.bmcl.2008.11.048
BindingDB Entry DOI: 10.7270/Q2JM27Z0