BDBM30542 5,6-Dihydro-1H-pyridin-2-one, 4an
SMILES: [H][C@]12CCC[C@@]1([H])C(=O)C(C(=O)N2Cc1ccc(F)c(C)c1)C1=Nc2ccc(NS(C)(=O)=O)cc2S(=O)(=O)N1
InChI Key: InChIKey=NDDHGYSHOLFFTA-NTEFNCDNSA-N
Data: 2 IC50  1 EC50
Activity Spreadsheet -- Enzyme Inhibition Constant Data from BindingDB
Found 2 hits for monomerid = 30542
Trg + Lig
Ki
nM
ΔG°
kcal/mole
IC50
nM
Kd
nM
EC50/IC50
nM
koff
s-1
kon
M-1s-1
pHTemp
°C
HCV NS3-NS4A Serine Proteinase
(Hepatitis C virus (HCV genotype 1a, isolate H))
BDBM30542
(5,6-Dihydro-1H-pyridin-2-one, 4an)
Show SMILES [H][C@]12CCC[C@@]1([H])C(=O)C(C(=O)N2Cc1ccc(F)c(C)c1)C1=Nc2ccc(NS(C)(=O)=O)cc2S(=O)(=O)N1 |r,t:25|
Show InChI InChI=1S/C24H25FN4O6S2/c1-13-10-14(6-8-17(13)25)12-29-19-5-3-4-16(19)22(30)21(24(29)31)23-26-18-9-7-15(27-36(2,32)33)11-20(18)37(34,35)28-23/h6-11,16,19,21,27H,3-5,12H2,1-2H3,(H,26,28)/t16-,19+,21?/m1/s1
n/an/a 28n/an/an/an/an/an/a
Anadys Pharmaceuticals
Assay Description
Assays were performed in a 96-well streptavidin-coated Flash-Plate using enzyme (NS5B H77 1a), RNA substrate, and [alpha-33P]GTP/GTP with inhibitor c...
Bioorg Med Chem Lett 19: 451-8 (2009)
Article DOI: 10.1016/j.bmcl.2008.11.048
BindingDB Entry DOI: 10.7270/Q2JM27Z0
Non-structural protein 5B (NS5B)
(Hepatitis C virus genotype 1b (isolate BK) (HCV))
BDBM30542
(5,6-Dihydro-1H-pyridin-2-one, 4an)
Show SMILES [H][C@]12CCC[C@@]1([H])C(=O)C(C(=O)N2Cc1ccc(F)c(C)c1)C1=Nc2ccc(NS(C)(=O)=O)cc2S(=O)(=O)N1 |r,t:25|
Show InChI InChI=1S/C24H25FN4O6S2/c1-13-10-14(6-8-17(13)25)12-29-19-5-3-4-16(19)22(30)21(24(29)31)23-26-18-9-7-15(27-36(2,32)33)11-20(18)37(34,35)28-23/h6-11,16,19,21,27H,3-5,12H2,1-2H3,(H,26,28)/t16-,19+,21?/m1/s1
n/an/a<10n/a 34n/an/an/an/a
Anadys Pharmaceuticals
Assay Description
Assays were performed in a 96-well streptavidin-coated Flash-Plate using enzyme, RNA substrate, and [alpha-33P]GTP/GTP with inhibitor concentration v...
Bioorg Med Chem Lett 19: 451-8 (2009)
Article DOI: 10.1016/j.bmcl.2008.11.048
BindingDB Entry DOI: 10.7270/Q2JM27Z0