BDBM306724 3-((1R,3R)-1-(2,6-difluoro-4-(2-((3-fluoropropyl)amino)ethoxy)phenyl)-3-methyl-1,3,4,9-tetrahydro-2H-pyrido[3,4-b]indol-2-yl)-2,2-difluoropropan-1-ol::US10149839, Example 10
SMILES: C[C@@H]1Cc2c([nH]c3ccccc23)[C@H](N1CC(F)(F)CO)c1c(F)cc(OCCNCCCF)cc1F
InChI Key:
Data: 2 IC50
Activity Spreadsheet -- Enzyme Inhibition Constant Data from BindingDB
Found 2 hits for monomerid = 306724
Trg + Lig
Ki
nM
ΔG°
kcal/mole
IC50
nM
Kd
nM
EC50/IC50
nM
koff
s-1
kon
M-1s-1
pHTemp
°C
Estrogen receptor
(Homo sapiens (Human))
BDBM306724
(3-((1R,3R)-1-(2,6-difluoro-4-(2-((3-fluoropropyl)a...)
Show SMILES C[C@@H]1Cc2c([nH]c3ccccc23)[C@H](N1CC(F)(F)CO)c1c(F)cc(OCCNCCCF)cc1F |r|
US Patent
n/an/a 0.120n/an/an/an/an/an/a
AstraZeneca AB
US Patent
Assay Description
The ability of compounds to down-regulate Estrogen Receptor (ER) numbers was assessed in a cell based immuno-fluorescence assay using the MCF-7 human...
US Patent US10149839 (2018)
BindingDB Entry DOI: 10.7270/Q28P62M5
Estrogen receptor
(Homo sapiens (Human))
BDBM306724
(3-((1R,3R)-1-(2,6-difluoro-4-(2-((3-fluoropropyl)a...)
Show SMILES C[C@@H]1Cc2c([nH]c3ccccc23)[C@H](N1CC(F)(F)CO)c1c(F)cc(OCCNCCCF)cc1F |r|
US Patent
n/an/a 1.10n/an/an/an/an/an/a
AstraZeneca AB
US Patent
Assay Description
Compounds were dosed directly from a compound source microplate containing serially diluted compound (4 wells containing 10 mM, 0.1 mM, 1 mM and 10 n...
US Patent US10149839 (2018)
BindingDB Entry DOI: 10.7270/Q28P62M5